{"text_format":"1","workbook":"xlsx","n_sheets":5,"sheets":["DADOS","BDI (1)","PO","PLQ","CFF"],"not_rendered":{"charts":0,"images":19,"macros":1,"external_links":0,"defined_names":122,"comments":0,"pivot_tables":0},"unopened":[],"bounds":{"document_bytes":16777216,"sheet_cells":100000,"rows_first":2000,"rows_last":500,"rows_between":2000,"halvings":0,"cell_chars":16384,"cell_head_chars":4096},"cells_cut":0,"cells_raw":0,"read":"whole","date_system":"1900"}

{"sheet":"DADOS","index":0,"n_rows":230,"n_cols":24,"rows_kept":230,"cut":false,"hidden":false,"merged":[[220,2,220,4],[219,5,219,8],[220,5,220,8],[219,15,219,23],[220,15,220,23],[27,9,27,14],[31,6,31,9],[30,10,30,15],[31,10,31,15],[27,15,27,23],[30,16,30,23],[31,16,31,23],[30,0,30,5],[27,2,27,4],[28,2,28,4],[27,5,27,8],[28,5,28,8],[31,0,31,5],[30,6,30,9],[28,15,28,23],[28,9,28,14],[66,0,66,23],[87,0,87,23],[42,10,42,12],[229,14,229,19],[228,7,228,8],[228,10,228,12],[228,14,228,19],[229,22,229,23],[223,16,223,23],[222,10,222,15],[79,0,79,23],[82,0,82,23],[229,0,229,1],[229,20,229,21],[229,10,229,12],[220,9,220,14],[226,6,226,18],[228,0,228,1],[228,2,228,6],[229,2,229,6],[229,7,229,8],[223,10,223,15],[222,16,222,23],[225,3,225,5],[84,0,84,23],[220,0,220,1],[222,0,222,5],[223,0,223,5],[223,6,223,9],[222,6,222,9],[219,2,219,4],[86,0,86,23],[228,22,228,23],[228,20,228,21],[42,7,42,8],[226,0,226,1],[225,6,225,18],[225,0,225,1],[219,0,219,1],[226,3,226,5],[47,0,47,2],[56,7,56,10],[53,1,53,4],[64,0,64,23],[54,7,54,10],[44,0,44,23],[62,0,62,23],[49,0,49,23],[54,1,54,4],[56,1,56,4],[53,7,53,10],[0,1,1,23],[55,7,55,10],[41,22,41,23],[36,0,36,1],[41,0,41,1],[42,22,42,23],[42,14,42,19],[42,2,42,6],[41,10,41,12],[42,20,42,21],[34,0,34,23],[36,6,36,18],[36,3,36,5],[3,0,3,23],[5,0,5,23],[7,0,7,23],[23,0,23,23],[13,0,13,23],[9,0,9,23],[11,0,11,23],[41,7,41,8],[55,1,55,4],[41,14,41,19],[42,0,42,1],[219,9,219,14],[98,0,98,23],[97,0,97,23],[96,0,96,23],[25,0,25,23],[27,0,27,1],[28,0,28,1],[68,0,68,23],[59,0,59,23],[61,0,61,23],[100,0,100,23],[94,0,94,23],[95,0,95,23],[37,0,37,1],[41,20,41,21],[69,0,69,23],[39,0,39,23],[99,0,99,23],[73,0,73,23],[80,0,80,23],[89,0,89,23],[92,0,92,23],[93,0,93,23],[91,0,91,23],[37,6,37,18],[85,0,85,23],[37,3,37,5],[41,2,41,6],[67,0,67,23],[77,0,77,23],[70,0,70,23],[71,0,71,23],[15,0,15,23],[17,0,17,23],[21,0,21,8],[75,0,75,23],[83,0,83,23],[76,0,76,23],[78,0,78,23],[81,0,81,23]]}
[27476,"PO - Planilha Orçamentária / PLQ - Planilha de Levantamento de Quantidades / CFF - Cronograma Físico Financeiro"]
["v008"]
[]
["INSTRUÇÕES DE USO E PREENCHIMENTO"]
[]
["1. Este documento somente pode ser utilizado nas versões do Excel 2003 ou superior. Não deve ser utilizado versões do BROffice. O Documento deve ser salvo SOMENTE em extensão habilitada para macros (.xls ou .xlsm). Se o documento for salvo na extensão .xlsx, o arquivo será INUTILIZADO. "]
[]
["2. Para funcionamento pleno desse arquivo, a Segurança de Macros do Excel deve ser habilitada."]
[]
["2.1  Na Versão Excel 2003, selecione na Faixa de Opções: Ferramentas --> Macro --> Segurança --> Na aba Nível de Segurança selecione a Opção \"Baixo\" --> Clique em OK --> Feche e abra o Excel novamente para utilizar a Planilha."]
[]
["2.2 Na Versão Excel 2007 ou superior, selecione na Faixa de Opções: Arquivo --> Opções --> Central de Confiabilidade --> Configurações da Central de Confiabilidade --> Configurações de Macro --> Habilitar todas as Macros --> Clique em OK --> Feche e abra o excel novamente para utilizar a Planilha."]
[]
["3. O Preenchimento deve ser feito somente nas células em amarelo. As outras células são de preenchimento Automático."]
[]
["4. Preferências de Elaboração do Orçamento"]
[]
["4.1. Preenchimento de Quantidades"]
[]
[]
[]
["5. Ordem de Preenchimento"]
[]
["5.1. na Aba DADOS"]
[]
["5.1.1. Preencha no Quadro abaixo os Dados do TC/CR:"]
[]
["Nº OPERAÇÃO",null,"GESTOR",null,null,"PROGRAMA",null,null,null,"AÇÃO / MODALIDADE",null,null,null,null,null,"OBJETO"]
[null,null,null,null,null,null,null,null,null,null,null,null,null,null,null,"RESIDENCIA EM MADEIRA"]
[]
["PROPONENTE / TOMADOR",null,null,null,null,null,"MUNICÍPIO / UF",null,null,null,"LOCALIDADE / ENDEREÇO",null,null,null,null,null,"APELIDO DO EMPREENDIMENTO"]
["PREFEITURA MUNICIPAL",null,null,null,null,null,"SÃO JOÃO DA URTIGA/RS"]
[]
[]
["5.1.2. Preencha no quadro abaixo as informações sobre o orçamento:"]
[]
["DATA BASE",null,"DESON.","LOCALIDADE DO SINAPI",null,null,"DESCRIÇÃO DO LOTE",null,null,null,null,null,null,null,null,null,null,null,null,"BDI 1","BDI 2","BDI 3","BDI 4","BDI 5"]
["2023-03-01",null,"Sim","Porto Alegre / RS",null,null,null,null,null,null,null,null,null,null,null,null,null,null,null,{"$f":"IF(ISERROR(INDIRECT(\"'BDI (\"&RIGHT(T37,1)&\")'!N27\")),\"\",INDIRECT(\"'BDI (\"&RIGHT(T37,1)&\")'!N27\"))","v":0.26379999999999998},{"$f":"IF(ISERROR(INDIRECT(\"'BDI (\"&RIGHT(U37,1)&\")'!N27\")),\"\",INDIRECT(\"'BDI (\"&RIGHT(U37,1)&\")'!N27\"))","v":""},{"$f":"IF(ISERROR(INDIRECT(\"'BDI (\"&RIGHT(V37,1)&\")'!N27\")),\"\",INDIRECT(\"'BDI (\"&RIGHT(V37,1)&\")'!N27\"))","v":""},{"$f":"IF(ISERROR(INDIRECT(\"'BDI (\"&RIGHT(W37,1)&\")'!N27\")),\"\",INDIRECT(\"'BDI (\"&RIGHT(W37,1)&\")'!N27\"))","v":""},{"$f":"IF(ISERROR(INDIRECT(\"'BDI (\"&RIGHT(X37,1)&\")'!N27\")),\"\",INDIRECT(\"'BDI (\"&RIGHT(X37,1)&\")'!N27\"))","v":""}]
[]
["4.1.2. Preencha no quadro abaixo as informações sobre o orçamento licitado:"]
[]
["CTEF n.º",null,"NOME DA EMPRESA ",null,null,null,null,"DATA BASE",null,"DESON.","REGIME DE EXECUÇÃO",null,null,"ACOMP.","OBJETO CTEF",null,null,null,null,null,"DATA ASSINATURA",null,"VIGÊNCIA"]
[]
[]
["5.1.3. Preencha a data de Início da Obra:"]
[]
["DATA INÍCIO"]
[]
[]
["5.1.4. Preencha no(s) Quadro(s) abaixo os Dados do(s) Responsável(is) Técnico(s) pela elaboração do Orçamento:"]
[]
[null,null,null,null,null,null,"Exibir o 2° Quadro de Assinatura?",null,null,null,"NÃO"]
[]
["Nome:","ADRIANA SCHENATTO",null,null,null,null,"Nome:"]
[{"$f":"IF(OR(TipoOrçamento=\"BASE\",TipoOrçamento=\"REPROGRAMADONPL\"),\"Título:\",\"Cargo:\")","v":"Título:"},"ENGENHEIRA CIVIL",null,null,null,null,{"$f":"A55","v":"Título:"}]
[{"$f":"IF(OR(TipoOrçamento=\"BASE\",TipoOrçamento=\"REPROGRAMADONPL\"),\"CREA/CAU:\",\"Empresa:\")","v":"CREA/CAU:"},"CREA/RS 91580",null,null,null,null,{"$f":"A56","v":"CREA/CAU:"}]
[{"$f":"IF(OR(TipoOrçamento=\"BASE\",TipoOrçamento=\"REPROGRAMADONPL\"),\"ART/RRT:\",\"CNPJ:\")","v":"ART/RRT:"},null,null,null,null,null,{"$f":"A57","v":"ART/RRT:"}]
[]
[]
["5.2. Legenda das Abas"]
[]
["5.2.1.  LARANJA: Aba DADOS. Preenchimento Obrigatório. Impressão Dispensada."]
["5.2.2.  AMARELO: Abas BDI, PO, PLQ e CFF. Preenchimento e Impressão Obrigatórias. O preenchimento da Aba BDI é dispensada para os casos de Aquisição Direta de Materiais e Equipamentos. A Impressão da Aba PLQ pode ser dispensada para casos de Frente de Obra Única."]
[]
["5.3. na Aba BDI (Bonificações e Despesas Indiretas):"]
[]
["5.3.1. Escolha o tipo de empreendimento."]
["5.3.2. Escolha se o BDI será do tipo desonerado ou não (aba DADOS)"]
["5.3.3. Informe a base de cálculo do ISS (0 a 100%)."]
["5.3.4. Informe a alíquota do ISS (Normalmente de 2 a 5%)."]
["5.3.5. Defina na tabela os percentuais a serem adotados para cada item que compõe o BDI nos campos em amarelo."]
["5.3.6. Preencha o campo observações se necessário (recomendado para os orçamentos que utilizam mais de um BDI)."]
[]
["5.4. na Aba PO (Planilha Orçamentária):"]
[]
["5.4.1. Primeiramente, selecione os níveis de cada item do orçamento na coluna NÍVEL."]
["5.4.1.1: O nível de \"Serviço\" serve tanto para serviços ou insumos (mão-de-obra / material / equipamento / veículo / máquina / ferramenta / etc). Um \"nível 2/3/4\" é um título (é preenchida apenas a coluna descrição) utilizado para organizar melhor a planilha orçamentária e engloba (agrupa) serviços e agrupadores de nível inferior."]
["5.4.2. Após a seleção dos níveis, preencha, para cada serviço, as informações sobre a Fonte de Referência, (SINAPI, SICRO, SIURB, etc) e o respectivo Código de Referência."]
["5.4.3. Esta planilha é compatível com o arquivo REFERÊNCIA distribuído pela CAIXA. Caso o arquivo REFERÊNCIA esteja aberto, será possível buscar um código através do botão \"Buscar Código\". Desta forma a descrição dos serviços será preenchida automaticamente (podendo ser substituída). Caso contrário, seu preenchimento deve ser manual."]
["5.4.3.1. As descrições e unidades preenchidas automaticamente ficarão vinculadas ao arquivo REFERÊNCIA até que se use o botão \"Fixar Descrições\", que quebra a fórmula e transforma as descrições em texto."]
["5.4.4. Preencher o custo unitário do serviço/insumo na Coluna CUSTO UNITÁRIO. ATENÇÃO: o custo unitário adotado deve ser menor ou igual ao contido na tabela de referência ou mediana das cotações de mercado."]
["5.4.5. Indicar o BDI adotado para cada serviço/insumo na Coluna BDI. Preferencialmente selecione uma das opções da lista suspensa que aparecerá na célula, esta lista contém os 05 BDIs que podem ser preenchidos na Aba BDI (conforme item 5.2 das instruções). Caso seja necessária a adoção de mais de 05 valores diferentes de BDI, digite o percentual diretamente na célula."]
["5.4.6. Conforme selecionado no item 4.1. desta Aba, a Coluna Quantidade pode ser preenchida diretamente na PO, ou representar a soma das quantidades de cada Frente de Obra, informadas na aba PLQ (Planilha de Levantamento de Quantitativos)."]
["5.4.7. OBSERVAÇÃO: As demais colunas (Item / Quantidade / Preço Unitário / Preço Total) são de preenchimento automático. Não tente preenche-las ou alterá-las na Aba PO."]
["5.4.8. Se for necessário acrescentar ou excluir linhas da Planilha Orçamentária, utilize o Botão EDITAR PLANILHA e selecione as opções no quadro.\nATENÇÃO: quanto maior o número de linhas mais lento será o processamento dos dados, então acrescente apenas o número necessário ou um pouco a mais."]
["5.4.8.1. Evite deixar linhas em branco no corpo da Planilha Orçamentária."]
["5.4.9. Caso deseje importar os dados de outro arquivo utilize apenas a opção COLAR ESPECIAL ==> VALORES."]
["5.4.10. Clique no Botão LICITAR / REPROGRAMAR para preencher o Orçamento Licitado ou Reprogramado."]
[]
["5.5. na Aba PLQ (Planilha de Levantamento de Quantitativos):"]
[]
["5.5.1. Preencha primeiramente as Frentes de Obra."]
["5.5.1.1. Exemplos de Frentes de Obra (Rua A trecho 01 / Rua A trecho 02 / Rua B ; UH 01 / UH 02 / UH 03). "]
["5.5.2. Preencha as quantidades dos serviços por frente de obra. A soma das quantidades de todas as frentes de um determinado serviço será a quantidade exibida na Planilha Orçamentária."]
["5.5.3. Caso deseje incluir ou excluir frentes, utilize os botões ADICIONAR e EXCLUIR."]
[]
["5.6. na Aba CFF (Cronograma Físico-Financeiro):"]
[]
["5.6.1. Preencha a data de início da obra na aba Dados."]
["5.6.2. Preencha as porcentagens previstas por parcela para cada meta ou macrosserviço."]
["5.6.3. Para atualizar o Cronograma conforme o Orçamento e incluir ou excluir parcelas, utilize o botão EDITAR / ATUALIZAR CRONOGRAMA."]
[]
[]
[]
[]
[]
[null,null,null,null,null,null,null,null,null,null,null,"(Selecione uma Localidade)"]
[null,null,null,null,null,null,null,null,null,null,null,"Aracaju / SE",null,null,null,null,null,null,{"$f":"T38","v":0.26379999999999998}]
[null,null,null,null,null,null,null,null,null,null,null,"Belém / PA",null,null,null,null,null,null,{"$f":"U38","v":""}]
[null,null,null,null,null,null,null,null,null,null,null,"Belo Horizonte / MG",null,null,null,null,null,null,{"$f":"V38","v":""}]
[null,null,null,null,null,null,null,null,null,null,null,"Boa Vista / RR",null,null,null,null,null,null,{"$f":"W38","v":""}]
[null,null,null,null,null,null,null,null,null,null,null,"Brasília / DF",null,null,null,null,null,null,{"$f":"X38","v":""}]
[null,null,null,null,null,null,null,null,null,null,null,"Campo Grande / MS"]
[null,null,null,null,null,null,null,null,null,null,null,"Cuiabá / MT"]
[null,null,null,null,null,null,null,null,null,null,null,"Curitiba / PR",null,null,null,"Empreitada Preço Global"]
[null,null,null,null,null,null,null,null,null,null,null,"Florianópolis / SC",null,null,null,"Empreitada Preço Unitário"]
[null,null,null,null,null,null,null,null,null,null,null,"Fortaleza / CE",null,null,null,"Empreitada Integral"]
[null,null,null,null,null,null,null,null,null,null,null,"Goiânia / GO",null,null,null,"Tarefa"]
[null,null,null,null,null,null,null,null,null,null,null,"João Pessoa / PB",null,null,null,"Contratação Integrada"]
[null,null,null,null,null,null,null,null,null,null,null,"Macapá / AP",null,null,null,"Não se aplica"]
[null,null,null,null,null,null,null,null,null,null,null,"Maceió / AL"]
[null,null,null,null,null,null,null,null,null,null,null,"Manaus / AM",null,null,null,"BM"]
[null,null,null,null,null,null,null,null,null,null,null,"Natal / RN",null,null,null,"PLE"]
[null,null,null,null,null,null,null,null,null,null,null,"Palmas / TO"]
[null,null,null,null,null,null,null,null,null,null,null,"Porto Alegre / RS"]
[null,null,null,null,null,null,null,null,null,null,null,"Porto Velho / RO"]
[null,null,null,null,null,null,null,null,null,null,null,"Recife / PE"]
[null,null,null,null,null,null,null,null,null,null,null,"Rio Branco / AC"]
[null,null,null,null,null,null,null,null,null,null,null,"Rio de Janeiro / RJ"]
[null,null,null,null,null,null,null,null,null,null,null,"Salvador / BA"]
[null,null,null,null,null,null,null,null,null,null,null,"São Luís / MA"]
[null,null,null,null,null,null,null,null,null,null,null,"São Paulo / SP"]
[null,null,null,null,null,null,null,null,null,null,null,"Teresina / PI"]
[null,null,null,null,null,null,null,null,null,null,null,"Vitória / ES"]
[]
[]
[]
[]
[]
[]
[]
[]
[]
[]
[]
[]
[]
[]
[]
[]
[]
[]
[]
[]
[]
[]
[]
[]
[]
[]
[]
[]
[]
[]
[]
[]
[]
[]
[]
[]
[]
[]
[]
[]
[]
[]
[]
[]
[]
[]
[]
[]
[]
[]
[]
[]
[]
[]
[]
[]
[]
[]
[]
[]
[]
[]
[]
[]
[]
[]
[]
[]
[]
[]
[]
[]
[]
[]
[]
[]
[]
[]
[]
[]
[]
[]
[]
[]
[]
[{"$f":"A28","v":"Nº OPERAÇÃO"},null,{"$f":"C28","v":"GESTOR"},null,null,{"$f":"F28","v":"PROGRAMA"},null,null,null,{"$f":"J28","v":"AÇÃO / MODALIDADE"},null,null,null,null,null,{"$f":"P28","v":"OBJETO"}]
[{"$f":"IF(A29=\"\",\"\",A29)","v":""},null,{"$f":"IF(C29=\"\",\"\",C29)","v":""},null,null,{"$f":"IF(F29=\"\",\"\",F29)","v":""},null,null,null,{"$f":"IF(J29=\"\",\"\",J29)","v":""},null,{"$f":"IF(#REF!=\"\",\"\",#REF!)","v":{"$error":"#REF!"}},null,{"$f":"IF(#REF!=\"\",\"\",#REF!)","v":{"$error":"#REF!"}},null,{"$f":"IF(P29=\"\",\"\",P29)","v":"RESIDENCIA EM MADEIRA"}]
[]
[{"$f":"A31","v":"PROPONENTE / TOMADOR"},null,null,null,null,null,{"$f":"G31","v":"MUNICÍPIO / UF"},null,null,null,{"$f":"K31","v":"LOCALIDADE / ENDEREÇO"},null,null,null,null,null,{"$f":"Q31","v":"APELIDO DO EMPREENDIMENTO"}]
[{"$f":"IF(A32=\"\",\"\",A32)","v":"PREFEITURA MUNICIPAL"},null,null,null,null,null,{"$f":"IF(G32=\"\",\"\",G32)","v":"SÃO JOÃO DA URTIGA/RS"},{"$f":"IF(I32=\"\",\"\",I32)","v":""},null,{"$f":"IF(#REF!=\"\",\"\",#REF!)","v":{"$error":"#REF!"}},{"$f":"IF(K32=\"\",\"\",K32)","v":""},null,null,null,null,null,{"$f":"IF(Q32=\"\",\"\",Q32)","v":""}]
[]
[{"$f":"A37","v":"DATA BASE"},null,{"$f":"C37","v":"DESON."},{"$f":"D37","v":"LOCALIDADE DO SINAPI"},null,null,{"$f":"G37","v":"DESCRIÇÃO DO LOTE"},null,null,null,null,null,null,null,null,null,null,null,null,{"$f":"T37","v":"BDI 1"},{"$f":"U37","v":"BDI 2"},{"$f":"V37","v":"BDI 3"},{"$f":"W37","v":"BDI 4"},{"$f":"X37","v":"BDI 5"}]
[{"$f":"IF(A38=\"\",\"\",A38)","v":"2023-03-01"},null,{"$f":"IF(C38=\"\",\"\",C38)","v":"Sim"},"Porto Alegre / RS","","","","","","","","","","","","","","","",0.26379999999999998,"","","",""]
[]
["CTEF n.º",null,"NOME DA EMPRESA / CNPJ:",null,null,null,null,"DATA BASE",null,"DESON.","REGIME DE EXECUÇÃO",null,null,"ACOMP.","OBJETO CTEF",null,null,null,null,null,"DATA ASSINATURA",null,"VIGÊNCIA"]
[{"$f":"IF(A43=\"\",\"\",A43)","v":""},null,{"$f":"IF(C43=\"\",\"\",C43)","v":""},null,{"$f":"IF(E43=\"\",\"\",E43)","v":""},null,{"$f":"IF(G43=\"\",\"\",G43)","v":""},{"$f":"IF(H43=\"\",\"\",H43)","v":""},{"$f":"IF(I43=\"\",\"\",I43)","v":""},{"$f":"IF(J43=\"\",\"\",J43)","v":""},{"$f":"IF(K43=\"\",\"\",K43)","v":""},null,{"$f":"IF(M43=\"\",\"\",M43)","v":""},{"$f":"IF(N43=\"\",\"\",N43)","v":""},{"$f":"IF(O43=\"\",\"\",O43)","v":""},null,{"$f":"IF(Q43=\"\",\"\",Q43)","v":""},null,{"$f":"IF(S43=\"\",\"\",S43)","v":""},null,{"$f":"IF(U43=\"\",\"\",U43)","v":""},null,{"$f":"IF(W43=\"\",\"\",W43)","v":""}]

{"sheet":"BDI (1)","index":1,"n_rows":59,"n_cols":23,"rows_kept":59,"cut":false,"hidden":false,"merged":[[47,15,47,17],[44,8,44,11],[42,8,42,11],[12,16,12,17],[13,8,13,15],[13,16,13,17],[15,12,16,12],[12,8,12,15],[15,15,16,15],[15,16,16,16],[15,13,16,13],[15,8,16,11],[15,14,16,14],[10,8,10,15],[10,16,10,17],[3,8,3,9],[3,10,3,17],[4,8,4,9],[4,10,4,17],[6,8,6,17],[7,8,7,17],[9,8,9,15],[9,16,9,17],[15,19,23,20],[41,8,41,11],[17,8,17,11],[18,8,18,11],[19,8,19,11],[20,8,20,11],[21,8,21,11],[22,8,22,11],[23,8,23,11],[24,8,24,11],[15,17,16,17],[36,8,36,17],[31,15,32,15],[31,12,31,14],[32,12,32,14],[31,11,32,11],[49,9,49,11],[28,9,28,17],[25,8,25,11],[26,8,26,11],[26,15,26,17],[44,14,44,17],[30,8,30,17],[34,8,34,17],[41,14,41,17],[48,9,48,11],[39,8,39,17],[45,8,45,11],[45,14,45,17],[46,9,46,11],[46,15,46,17],[47,9,47,11]]}
[null,null,null,null,"MIN","MED","MAX",null,null,null,null,null,null,{"$f":"\"Quadro de Composição do BDI \"&MID(CELL(\"nome.arquivo\",N1),5+FIND(\"BDI (\",CELL(\"nome.arquivo\",N1)),1)","v":"Quadro de Composição do BDI 1"}]
["Construção e Reforma de Edifícios","AC",{"$f":"CONCATENATE(A2,\"-\",B2)","v":"Construção e Reforma de Edifícios-AC"},null,0.03,0.04,5.5E-2]
[{"$f":"A2","v":"Construção e Reforma de Edifícios"},"SG","Construção e Reforma de Edifícios-SG",null,8.0000000000000002E-3,8.0000000000000002E-3,0.01]
[{"$f":"A3","v":"Construção e Reforma de Edifícios"},"R","Construção e Reforma de Edifícios-R",null,9.7000000000000003E-3,1.2699999999999999E-2,1.2699999999999999E-2,null,"Nº TC/CR",null,"PROPONENTE / TOMADOR"]
[{"$f":"A4","v":"Construção e Reforma de Edifícios"},"DF","Construção e Reforma de Edifícios-DF",null,5.8999999999999999E-3,1.23E-2,1.3899999999999999E-2,null,{"$f":"DADOS!A29","v":0},null,{"$f":"DADOS!A32","v":"PREFEITURA MUNICIPAL"}]
[{"$f":"A5","v":"Construção e Reforma de Edifícios"},"L","Construção e Reforma de Edifícios-L",null,6.1600000000000002E-2,7.400000000000001E-2,8.9600000000000013E-2]
[{"$f":"A6","v":"Construção e Reforma de Edifícios"},"BDI PAD","Construção e Reforma de Edifícios-BDI PAD",null,0.2034,0.22120000000000001,0.25,null,"OBJETO"]
["Construção de Praças Urbanas, Rodovias, Ferrovias e recapeamento e pavimentação de vias urbanas","AC","Construção de Praças Urbanas, Rodovias, Ferrovias e recapeamento e pavimentação de vias urbanas-AC",null,3.7999999999999999E-2,4.0099999999999997E-2,4.6699999999999998E-2,null,{"$f":"DADOS!P29","v":"RESIDENCIA EM MADEIRA"}]
["Construção de Praças Urbanas, Rodovias, Ferrovias e recapeamento e pavimentação de vias urbanas","SG","Construção de Praças Urbanas, Rodovias, Ferrovias e recapeamento e pavimentação de vias urbanas-SG",null,3.2000000000000002E-3,4.0000000000000001E-3,7.4000000000000003E-3]
["Construção de Praças Urbanas, Rodovias, Ferrovias e recapeamento e pavimentação de vias urbanas","R","Construção de Praças Urbanas, Rodovias, Ferrovias e recapeamento e pavimentação de vias urbanas-R",null,5.0000000000000001E-3,5.6000000000000008E-3,9.7000000000000003E-3,null,"TIPO DE OBRA DO EMPREENDIMENTO",null,null,null,null,null,null,null,"DESONERAÇÃO"]
["Construção de Praças Urbanas, Rodovias, Ferrovias e recapeamento e pavimentação de vias urbanas","DF","Construção de Praças Urbanas, Rodovias, Ferrovias e recapeamento e pavimentação de vias urbanas-DF",null,1.0200000000000001E-2,1.11E-2,1.21E-2,null,"Construção e Reforma de Edifícios",null,null,null,null,null,null,null,{"$f":"DADOS!$C$38","v":"Sim"}]
["Construção de Praças Urbanas, Rodovias, Ferrovias e recapeamento e pavimentação de vias urbanas","L","Construção de Praças Urbanas, Rodovias, Ferrovias e recapeamento e pavimentação de vias urbanas-L",null,6.6400000000000001E-2,7.2999999999999995E-2,8.6899999999999991E-2]
["Construção de Praças Urbanas, Rodovias, Ferrovias e recapeamento e pavimentação de vias urbanas","BDI PAD","Construção de Praças Urbanas, Rodovias, Ferrovias e recapeamento e pavimentação de vias urbanas-BDI PAD",null,0.19600000000000001,0.2097,0.24230000000000002,null,"Conforme legislação tributária municipal, definir estimativa de percentual da base de cálculo para o ISS:",null,null,null,null,null,null,null,1]
["Construção de Redes de Abastecimento de Água, Coleta de Esgoto","AC","Construção de Redes de Abastecimento de Água, Coleta de Esgoto-AC",null,3.4300000000000004E-2,4.9299999999999997E-2,6.7099999999999993E-2,null,"Sobre a base de cálculo, definir a respectiva alíquota do ISS (entre 2% e 5%):",null,null,null,null,null,null,null,0.02]
[{"$f":"A14","v":"Construção de Redes de Abastecimento de Água, Coleta de Esgoto"},"SG","Construção de Redes de Abastecimento de Água, Coleta de Esgoto-SG",null,2.8000000000000004E-3,4.8999999999999998E-3,7.4999999999999997E-3]
[null,null,null,null,null,null,null,null,"Itens",null,null,null,"Siglas","% Adotado","Situação","1º Quartil","Médio","3º Quartil",null,{"$f":"IF(V27,\"Para BDI fora do intervalo estatístico, deve ser apresentado Relatório Técnico Circunstanciado justificando a adoção do percentual de cada parcela do BDI.\",\"\")","v":""}]
[{"$f":"A15","v":"Construção de Redes de Abastecimento de Água, Coleta de Esgoto"},"R","Construção de Redes de Abastecimento de Água, Coleta de Esgoto-R",null,0.01,1.3899999999999999E-2,1.7399999999999999E-2]
[{"$f":"A17","v":"Construção de Redes de Abastecimento de Água, Coleta de Esgoto"},"DF","Construção de Redes de Abastecimento de Água, Coleta de Esgoto-DF",null,9.3999999999999986E-3,9.8999999999999991E-3,1.1699999999999999E-2,null,{"$f":"IF($I$11=$A$59,\"Encargos Sociais incidentes sobre a mão de obra\",\"Administração Central\")","v":"Administração Central"},null,null,null,{"$f":"IF($I$11=$A$59,\"K1\",\"AC\")","v":"AC"},0.03,"-",{"$f":"VLOOKUP(CONCATENATE(I$11,\"-\",M18),$C$2:$G$49,3,FALSE)","v":0.03},{"$f":"VLOOKUP(CONCATENATE(I$11,\"-\",M18),$C$2:$G$49,4,FALSE)","v":0.04},{"$f":"VLOOKUP(CONCATENATE(I$11,\"-\",M18),$C$2:$G$49,5,FALSE)","v":5.5E-2}]
[{"$f":"A18","v":"Construção de Redes de Abastecimento de Água, Coleta de Esgoto"},"L","Construção de Redes de Abastecimento de Água, Coleta de Esgoto-L",null,6.7400000000000002E-2,8.0399999999999985E-2,9.4E-2,null,{"$f":"IF($I$11=$A$59,\"Administração Central da empresa ou consultoria - overhead\",\"Seguro e Garantia\")","v":"Seguro e Garantia"},null,null,null,{"$f":"IF($I$11=$A$59,\"K2\",\"SG\")","v":"SG"},8.0000000000000002E-3,"-",{"$f":"VLOOKUP(CONCATENATE(I$11,\"-\",M19),$C$2:$G$49,3,FALSE)","v":8.0000000000000002E-3},{"$f":"VLOOKUP(CONCATENATE(I$11,\"-\",M19),$C$2:$G$49,4,FALSE)","v":8.0000000000000002E-3},{"$f":"VLOOKUP(CONCATENATE(I$11,\"-\",M19),$C$2:$G$49,5,FALSE)","v":0.01}]
[{"$f":"A19","v":"Construção de Redes de Abastecimento de Água, Coleta de Esgoto"},"BDI PAD","Construção de Redes de Abastecimento de Água, Coleta de Esgoto-BDI PAD",null,0.20760000000000001,0.24179999999999999,0.26440000000000002,null,{"$f":"IF($I$11=$A$59,\"\",\"Risco\")","v":"Risco"},null,null,null,{"$f":"IF($I$11=$A$59,\"\",\"R\")","v":"R"},1.2699999999999999E-2,"-",{"$f":"VLOOKUP(CONCATENATE(I$11,\"-\",M20),$C$2:$G$49,3,FALSE)","v":9.7000000000000003E-3},{"$f":"VLOOKUP(CONCATENATE(I$11,\"-\",M20),$C$2:$G$49,4,FALSE)","v":1.2699999999999999E-2},{"$f":"VLOOKUP(CONCATENATE(I$11,\"-\",M20),$C$2:$G$49,5,FALSE)","v":1.2699999999999999E-2}]
["Construção e Manutenção de Estações e Redes de Distribuição de Energia Elétrica","AC","Construção e Manutenção de Estações e Redes de Distribuição de Energia Elétrica-AC",null,5.2900000000000003E-2,5.9200000000000003E-2,7.9299999999999995E-2,null,{"$f":"IF($I$11=$A$59,\"\",\"Despesas Financeiras\")","v":"Despesas Financeiras"},null,null,null,{"$f":"IF($I$11=$A$59,\"\",\"DF\")","v":"DF"},0.01,"-",{"$f":"VLOOKUP(CONCATENATE(I$11,\"-\",M21),$C$2:$G$49,3,FALSE)","v":5.8999999999999999E-3},{"$f":"VLOOKUP(CONCATENATE(I$11,\"-\",M21),$C$2:$G$49,4,FALSE)","v":1.23E-2},{"$f":"VLOOKUP(CONCATENATE(I$11,\"-\",M21),$C$2:$G$49,5,FALSE)","v":1.3899999999999999E-2}]
[{"$f":"A21","v":"Construção e Manutenção de Estações e Redes de Distribuição de Energia Elétrica"},"SG","Construção e Manutenção de Estações e Redes de Distribuição de Energia Elétrica-SG",null,2.5000000000000001E-3,5.1000000000000004E-3,5.6000000000000008E-3,null,{"$f":"IF($I$11=$A$59,\"Margem bruta da empresa de consultoria\",\"Lucro\")","v":"Lucro"},null,null,null,{"$f":"IF($I$11=$A$59,\"K3\",\"L\")","v":"L"},7.0000000000000007E-2,"-",{"$f":"VLOOKUP(CONCATENATE(I$11,\"-\",M22),$C$2:$G$49,3,FALSE)","v":6.1600000000000002E-2},{"$f":"VLOOKUP(CONCATENATE(I$11,\"-\",M22),$C$2:$G$49,4,FALSE)","v":7.400000000000001E-2},{"$f":"VLOOKUP(CONCATENATE(I$11,\"-\",M22),$C$2:$G$49,5,FALSE)","v":8.9600000000000013E-2}]
[{"$f":"A22","v":"Construção e Manutenção de Estações e Redes de Distribuição de Energia Elétrica"},"R","Construção e Manutenção de Estações e Redes de Distribuição de Energia Elétrica-R",null,0.01,1.4800000000000001E-2,1.9699999999999999E-2,null,"Tributos (impostos COFINS 3%, e  PIS 0,65%)",null,null,null,"CP",3.6499999999999998E-2,"-",3.6499999999999998E-2,3.6499999999999998E-2,3.6499999999999998E-2]
[{"$f":"A23","v":"Construção e Manutenção de Estações e Redes de Distribuição de Energia Elétrica"},"DF","Construção e Manutenção de Estações e Redes de Distribuição de Energia Elétrica-DF",null,1.01E-2,1.0700000000000001E-2,1.11E-2,null,"Tributos (ISS, variável de acordo com o município)",null,null,null,"ISS",{"$f":"IF($I$11<>$A$58,Q14*Q13,0)","v":0.02},"-",0,2.5000000000000001E-2,0.05]
[{"$f":"A24","v":"Construção e Manutenção de Estações e Redes de Distribuição de Energia Elétrica"},"L","Construção e Manutenção de Estações e Redes de Distribuição de Energia Elétrica-L",null,0.08,8.3100000000000007E-2,9.5100000000000004E-2,null,"Tributos (Contribuição Previdenciária sobre a Receita Bruta - 0% ou 4,5% - Desoneração)",null,null,null,"CPRB",{"$f":"IF(AND($I$11<>$A$58,Q11=\"Sim\"),4.5%,0%)","v":4.4999999999999998E-2},{"$f":"IF(AND(N25>=P25, N25<=R25), \"OK\", \"Não OK\")","v":"OK"},0,4.4999999999999998E-2,4.4999999999999998E-2]
[{"$f":"A25","v":"Construção e Manutenção de Estações e Redes de Distribuição de Energia Elétrica"},"BDI PAD","Construção e Manutenção de Estações e Redes de Distribuição de Energia Elétrica-BDI PAD",null,0.24,0.25840000000000002,0.27860000000000001,null,"BDI SEM desoneração\n(Fórmula Acórdão TCU)",null,null,null,"BDI PAD",{"$f":"IF($I$11=$A$58,0,ROUND((((1+N18+N19+N20)*(1+N21)*(1+N22)/(1-(N23+N24)))-1),4))","v":0.20349999999999999},{"$f":"IF(OR($I$11=$A$59,$I$11=$A$58,AND(N26>=P26, N26<=R26)), \"OK\", \"FORA DO INTERVALO\")","v":"OK"},{"$f":"IF($I$11=$A$58,0,VLOOKUP(CONCATENATE($I$11,\"-\",$M26),$C$2:$G$49,3,FALSE))","v":0.2034},{"$f":"IF($I$11=$A$58,0,VLOOKUP(CONCATENATE($I$11,\"-\",$M26),$C$2:$G$49,4,FALSE))","v":0.22120000000000001},{"$f":"IF($I$11=$A$58,0,VLOOKUP(CONCATENATE($I$11,\"-\",$M26),$C$2:$G$49,5,FALSE))","v":0.25}]
["Obras Portuárias, Marítimas e Fluviais","AC","Obras Portuárias, Marítimas e Fluviais-AC",null,0.04,5.5199999999999999E-2,7.85E-2,null,"BDI COM desoneração",null,null,null,"BDI DES",{"$f":"IF($I$11=$A$58,0,ROUND((((1+N18+N19+N20)*(1+N21)*(1+N22)/(1-(N23+N24+N25)))-1),4))","v":0.26379999999999998},{"$f":"IF(Q11<>\"Sim\",\"\",O26)","v":"OK"},null,null,null,null,null,null,{"$f":"AND(COUNTA(N18:N23)=6,O26<>\"ok\",NOT(V29))","v":false},"pedir anexo"]
[{"$f":"A27","v":"Obras Portuárias, Marítimas e Fluviais"},"SG","Obras Portuárias, Marítimas e Fluviais-SG",null,8.1000000000000013E-3,1.2199999999999999E-2,1.9900000000000001E-2]
[{"$f":"A28","v":"Obras Portuárias, Marítimas e Fluviais"},"R","Obras Portuárias, Marítimas e Fluviais-R",null,1.46E-2,2.3199999999999998E-2,3.1600000000000003E-2,null,{"$f":"IF(V29,\"X\",\"\")","v":""},"Anexo: Relatório Técnico Circunstanciado justificando a adoção do percentual de cada parcela do BDI.",null,null,null,null,null,null,null,null,null,null,null,false,"anexo apresentado"]
[]
[null,null,null,null,null,null,null,null,"Os valores de BDI foram calculados com o emprego da fórmula:"]
[{"$f":"A29","v":"Obras Portuárias, Marítimas e Fluviais"},"DF","Obras Portuárias, Marítimas e Fluviais-DF",null,9.3999999999999986E-3,1.0200000000000001E-2,1.3300000000000001E-2,null,null,null,null,{"$f":"IF(Q11=\"Sim\",\"BDI.DES =\",\"BDI.PAD =\")","v":"BDI.DES ="},{"$f":"IF($I$11=$A$59,\"(1+K1+K2)*(1+K3)\",\"(1+AC + S + R + G)*(1 + DF)*(1+L)\")","v":"(1+AC + S + R + G)*(1 + DF)*(1+L)"},null,null," - 1"]
[{"$f":"A32","v":"Obras Portuárias, Marítimas e Fluviais"},"L","Obras Portuárias, Marítimas e Fluviais-L",null,7.1399999999999991E-2,8.4000000000000005E-2,0.1043,null,null,null,null,null,{"$f":"IF(Q11=\"Sim\",\"(1-CP-ISS-CRPB)\",\"(1-CP-ISS)\")","v":"(1-CP-ISS-CRPB)"}]
[{"$f":"A33","v":"Obras Portuárias, Marítimas e Fluviais"},"BDI PAD","Obras Portuárias, Marítimas e Fluviais-BDI PAD",null,0.22800000000000001,0.27479999999999999,0.3095]
[null,null,null,null,null,null,null,null,{"$f":"CONCATENATE(\"Declaro para os devidos fins que, conforme legislação tributária municipal, a base de cálculo para \",I11,\", é de \",Q13*100,\"%, com a respectiva alíquota de \",Q14*100,\"%.\")","v":"Declaro para os devidos fins que, conforme legislação tributária municipal, a base de cálculo para Construção e Reforma de Edifícios, é de 100%, com a respectiva alíquota de 2%."}]
[]
[null,null,null,null,null,null,null,null,{"$f":"CONCATENATE(\"Declaro para os devidos fins que o regime de Contribuição Previdenciária sobre a Receita Bruta adotado para elaboração do orçamento foi \",IF(Q11=\"Sim\",\"COM\",\"SEM\"),\" Desoneração, e que esta é a alternativa mais adequada para a Administração Pública.\")","v":"Declaro para os devidos fins que o regime de Contribuição Previdenciária sobre a Receita Bruta adotado para elaboração do orçamento foi COM Desoneração, e que esta é a alternativa mais adequada para a Administração Pública."}]
["Fornecimento de Materiais e Equipamentos (aquisição indireta - em conjunto com licitação de obras)","AC","Fornecimento de Materiais e Equipamentos (aquisição indireta - em conjunto com licitação de obras)-AC",null,1.4999999999999999E-2,3.4500000000000003E-2,4.4900000000000002E-2]
[{"$f":"A38","v":"Fornecimento de Materiais e Equipamentos (aquisição indireta - em conjunto com licitação de obras)"},"SG","Fornecimento de Materiais e Equipamentos (aquisição indireta - em conjunto com licitação de obras)-SG",null,3.0000000000000001E-3,4.7999999999999996E-3,8.199999999999999E-3,null,"Observações:"]
[{"$f":"A39","v":"Fornecimento de Materiais e Equipamentos (aquisição indireta - em conjunto com licitação de obras)"},"R","Fornecimento de Materiais e Equipamentos (aquisição indireta - em conjunto com licitação de obras)-R",null,5.6000000000000008E-3,8.5000000000000006E-3,8.8999999999999999E-3]
[{"$f":"A40","v":"Fornecimento de Materiais e Equipamentos (aquisição indireta - em conjunto com licitação de obras)"},"DF","Fornecimento de Materiais e Equipamentos (aquisição indireta - em conjunto com licitação de obras)-DF",null,8.5000000000000006E-3,8.5000000000000006E-3,1.11E-2]
[{"$f":"A41","v":"Fornecimento de Materiais e Equipamentos (aquisição indireta - em conjunto com licitação de obras)"},"L","Fornecimento de Materiais e Equipamentos (aquisição indireta - em conjunto com licitação de obras)-L",null,3.5000000000000003E-2,5.1100000000000007E-2,6.2199999999999998E-2,null,{"$f":"PO!K153","v":"SÃO JOÃO DA URTIGA/RS"},null,null,null,null,null,{"$f":"PO!K156","v":"2023-06-06"}]
[{"$f":"A42","v":"Fornecimento de Materiais e Equipamentos (aquisição indireta - em conjunto com licitação de obras)"},"BDI PAD","Fornecimento de Materiais e Equipamentos (aquisição indireta - em conjunto com licitação de obras)-BDI PAD",null,0.111,0.14019999999999999,0.16800000000000001,null,"Local",null,null,null,null,null,"Data"]
["Estudos e Projetos, Planos e Gerenciamento e outros correlatos","K1","Estudos e Projetos, Planos e Gerenciamento e outros correlatos-K1",null,"-","-","-"]
[{"$f":"A44","v":"Estudos e Projetos, Planos e Gerenciamento e outros correlatos"},"K2","Estudos e Projetos, Planos e Gerenciamento e outros correlatos-K2",null,"-",0.2,"-"]
[{"$f":"A45","v":"Estudos e Projetos, Planos e Gerenciamento e outros correlatos"},"","Estudos e Projetos, Planos e Gerenciamento e outros correlatos-",null,"-","-","-",null,"Responsável Técnico",null,null,null,null,null,"Responsável Tomador"]
[{"$f":"A46","v":"Estudos e Projetos, Planos e Gerenciamento e outros correlatos"},"","Estudos e Projetos, Planos e Gerenciamento e outros correlatos-",null,"-","-","-",null,"Nome:",{"$f":"DADOS!B54","v":"ADRIANA SCHENATTO"},null,null,null,null,"Nome:","CEZAR OLIMPIO ZANDONA"]
[{"$f":"A47","v":"Estudos e Projetos, Planos e Gerenciamento e outros correlatos"},"K3","Estudos e Projetos, Planos e Gerenciamento e outros correlatos-K3",null,"-",0.12,"-",null,"Título:",{"$f":"DADOS!B55","v":"ENGENHEIRA CIVIL"},null,null,null,null,"Cargo:","PREFEITO MUNICIPAL"]
[{"$f":"A48","v":"Estudos e Projetos, Planos e Gerenciamento e outros correlatos"},"BDI PAD","Estudos e Projetos, Planos e Gerenciamento e outros correlatos-BDI PAD",null,"-","-","-",null,{"$f":"DADOS!A56","v":"CREA/CAU:"},{"$f":"DADOS!B56","v":"CREA/RS 91580"}]
[null,null,null,null,null,null,null,null,{"$f":"DADOS!A57","v":"ART/RRT:"},{"$f":"DADOS!B57","v":0}]
[]
["Construção e Reforma de Edifícios"]
["Construção de Praças Urbanas, Rodovias, Ferrovias e recapeamento e pavimentação de vias urbanas"]
["Construção de Redes de Abastecimento de Água, Coleta de Esgoto"]
["Construção e Manutenção de Estações e Redes de Distribuição de Energia Elétrica"]
["Obras Portuárias, Marítimas e Fluviais"]
["Fornecimento de Materiais e Equipamentos (aquisição indireta - em conjunto com licitação de obras)"]
["Fornecimento de Materiais e Equipamentos (aquisição direta)"]
["Estudos e Projetos, Planos e Gerenciamento e outros correlatos"]

{"sheet":"PO","index":2,"n_rows":157,"n_cols":26,"rows_kept":157,"cut":false,"hidden":false,"merged":[[1,22,1,23],[149,10,149,19],[145,10,147,19],[142,12,142,19],[155,10,155,12],[152,10,152,12]]}
[null,null,null,null,null,null,null,null,null,null,null,null,null,"PO - PLANILHA ORÇAMENTÁRIA",null,null,null,null,null,"Grau de Sigilo"]
[null,"LOTE","Meta","Nível 2","Nível 3","Nível 4","Serviço",null,null,null,null,null,null,{"$f":"CHOOSE(1+LOG(1+2*(TipoOrçamento=\"BASE\")+4*(TipoOrçamento=\"LICITADO\")+8*(TipoOrçamento=\"REPROGRAMADOAC\")+16*(TipoOrçamento=\"REPROGRAMADONPL\"),2),\"nada\",\"Orçamento Base para Licitação\",\"Orçamento Licitado\",\"Orçamento Licitado Reprogramado\",\"Orçamento Base para Licitação - Reprogramado\")","v":"Orçamento Base para Licitação"},null,null,null,null,null,"#PUBLICO",null,null,"Arredondamento"]
[null,null,null,null,null,null,null,null,null,null,null,null,null,null,null,null,null,null,null,null,null,null,"Quantidade",true]
["Nmax",null,null,null,null,null,null,null,null,null,null,null,null,null,null,null,null,null,null,null,"ERRO GERAL",null,"Custo Unitáro",true]
[{"$f":"MAX($A$12:$A$142)","v":2},null,null,null,null,null,null,null,null,null,null,null,null,null,null,null,null,null,null,null,{"$f":"IF(COUNTIF($U$12:OFFSET($U$142,-1,0),\"DESCRIÇÃO\")+COUNTIF($U$12:OFFSET($U$142,-1,0),\"UNIDADE\")+COUNTIF($U$12:OFFSET($U$142,-1,0),\"SEM VALOR\")>0,\"NÃO OK\",\"OK\")","v":"NÃO OK"},"","BDI",true]
[null,null,null,null,null,null,null,null,null,null,null,null,null,null,null,null,null,null,null,null,null,null,"Preço Unitário",true]
[null,null,null,null,null,null,null,null,null,null,null,null,null,null,null,null,null,null,null,null,null,null,"Preço Total",true]
[]
[null,null,null,null,null,null,null,null,null,null,null,null,null,null,null,{"$f":"OFFSET(PLQ!$E$12,ROW($P9)-ROW(P$12),0)","v":"-"}]
["Nível","Altura","n1","n2","n3","n4","n5","Czero","Cnível","Nível","Item","Fonte","Código","Descrição","Unidade","Quantidade",{"$f":"IF(OR(TipoOrçamento=\"LICITADO\",TipoOrçamento=\"REPROGRAMADOAC\"),\"Preço Unitário (R$)\",\"Custo Unitário (R$)\")","v":"Custo Unitário (R$)"},"BDI\n(%)","Preço Unitário (R$)","Preço Total\n(R$)","Erro de Dados","Lista Crono","Concatenação Fonte-Código","BancoRef",{"$f":"IF(TipoOrçamento=\"LICITADO\",\"Preço Unitário Edital (R$)\",\"Custo Unitário Referência (R$)\")","v":"Custo Unitário Referência (R$)"},{"$f":"IF(TipoOrçamento=\"LICITADO\",\"Valor BDI Edital\",\"Valor BDI\")","v":"Valor BDI"}]
[{"$f":"CHOOSE(1+LOG(1+2*(J11=\"Meta\")+4*(J11=\"Nível 2\")+8*(J11=\"Nível 3\")+16*(J11=\"Nível 4\")+32*(J11=\"Serviço\"),2),0,1,2,3,4,\"S\")","v":"S"},{"$f":"IF(OR(A11=\"S\",A11=0),0,IF(ISERROR(I11),H11,SMALL(H11:I11,1)))","v":0},{"$f":"IF($A11=1,OFFSET(C11,-1,0)+1,OFFSET(C11,-1,0))","v":"n1"},{"$f":"IF($A11=1,0,IF($A11=2,OFFSET(D11,-1,0)+1,OFFSET(D11,-1,0)))","v":"n2"},{"$f":"IF(AND($A11<=2,$A11<>0),0,IF($A11=3,OFFSET(E11,-1,0)+1,OFFSET(E11,-1,0)))","v":"n3"},{"$f":"IF(AND($A11<=3,$A11<>0),0,IF($A11=4,OFFSET(F11,-1,0)+1,OFFSET(F11,-1,0)))","v":"n4"},{"$f":"IF(AND($A11<=4,$A11<>0),0,IF($A11=\"S\",OFFSET(G11,-1,0)+1,OFFSET(G11,-1,0)))","v":{"$error":"#VALUE!"}},{"$f":"IF(OR($A11=\"S\",$A11=0),0,MATCH(0,OFFSET($B11,1,$A11,ROW($A$142)-ROW($A11)),0))","v":0},{"$f":"IF(OR($A11=\"S\",$A11=0),0,MATCH(OFFSET($B11,0,$A11)+1,OFFSET($B11,1,$A11,ROW($A$142)-ROW($A11)),0))","v":0},"Serviço",{"$f":"IF($A11=0,\"-\",CONCATENATE(C11&\".\",IF(AND($A$5>=2,$A11>=2),D11&\".\",\"\"),IF(AND($A$5>=3,$A11>=3),E11&\".\",\"\"),IF(AND($A$5>=4,$A11>=4),F11&\".\",\"\"),IF($A11=\"S\",G11&\".\",\"\")))","v":{"$error":"#VALUE!"}},null,null,{"$f":"IF($A11=\"S\",Referencia.Descricao,\"(digite a descrição aqui)\")","v":""},{"$f":"Referencia.Unidade","v":""},{"$f":"OFFSET(PLQ!$E$12,ROW($P11)-ROW(P$12),0)","v":0},null,"BDI 1",{"$f":"IF($A11=\"S\",IF($Q$10=\"Preço Unitário (R$)\",PO.CustoUnitario,ROUND(PO.CustoUnitario*(1+$Z11),15-13*$X$6)),0)","v":0},{"$f":"IF($A11=\"S\",VTOTAL1,IF($A11=0,0,ROUND(SomaAgrup,15-13*$X$7)))","v":0},{"$f":"IF($J11=\"\",\"\",IF($N11=\"\",\"DESCRIÇÃO\",IF(AND($J11=\"Serviço\",$O11=\"\"),\"UNIDADE\",IF($T11<=0,\"SEM VALOR\",IF(AND($Y11<>\"\",$Q11>$Y11),\"ACIMA REF.\",\"\")))))","v":"DESCRIÇÃO"},{"$f":"IF(OR($A11=0,$A11=\"S\",$A11>CFF!$A$9),\"\",MAX(V$12:OFFSET(V11,-1,0))+1)","v":""},{"$f":"IF(AND($J11=\"Serviço\",$M11<>\"\"),IF($L11=\"\",$M11,CONCATENATE($L11,\"-\",$M11)))","v":false},{"$f":"IF(AND(Fonte<>\"\",Código<>\"\"),MATCH(Fonte&\" \"&IF(Fonte=\"sinapi\",SUBSTITUTE(SUBSTITUTE(Código,\"/00\",\"/\"),\"/0\",\"/\"),Código),INDIRECT(\"'[Referência \"&_xlnm.Database&\".xls]Banco'!$a:$a\"),0),\"X\")","v":"X"},{"$f":"IF(Import.Desoneracao=\"sim\",Referencia.Desonerado,Referencia.NaoDesonerado)","v":0},{"$f":"ROUND(IF(ISNUMBER(R11),R11,IF(LEFT(R11,3)=\"BDI\",HLOOKUP(R11,DADOS!$T$37:$X$38,2,FALSE),0)),15-11*$X$5)","v":0.26379999999999998}]
[0,{"$f":"COUNTA(OFFSET(B12,1,0):B$142)","v":129},null,null,null,null,null,null,null,{"$f":"IF(OR(TipoOrçamento=\"LICITADO\",TipoOrçamento=\"REPROGRAMADOAC\"),\"CTEF\",\"LOTE\")","v":"LOTE"},0,null,null,{"$f":"IF(TipoOrçamento=\"LICITADO\",DADOS!O43,DADOS!G38)","v":0},null,null,null,null,null,{"$f":"SUMIF(OFFSET($J12,1,0,ROW(T142)-ROW(T12)-1),\"Serviço\",OFFSET(T12,1,0,ROW(T142)-ROW(T12)-1))","v":91360.200000000041},{"$f":"IF($N12=0,\"DESCRIÇÃO\",\"\")","v":"DESCRIÇÃO"},0]
[{"$f":"CHOOSE(1+LOG(1+2*(J13=\"Meta\")+4*(J13=\"Nível 2\")+8*(J13=\"Nível 3\")+16*(J13=\"Nível 4\")+32*(J13=\"Serviço\"),2),0,1,2,3,4,\"S\")","v":1},{"$f":"IF(OR(A13=\"S\",A13=0),0,IF(ISERROR(I13),H13,SMALL(H13:I13,1)))","v":129},{"$f":"IF($A13=1,OFFSET(C13,-1,0)+1,OFFSET(C13,-1,0))","v":1},{"$f":"IF($A13=1,0,IF($A13=2,OFFSET(D13,-1,0)+1,OFFSET(D13,-1,0)))","v":0},{"$f":"IF(AND($A13<=2,$A13<>0),0,IF($A13=3,OFFSET(E13,-1,0)+1,OFFSET(E13,-1,0)))","v":0},{"$f":"IF(AND($A13<=3,$A13<>0),0,IF($A13=4,OFFSET(F13,-1,0)+1,OFFSET(F13,-1,0)))","v":0},{"$f":"IF(AND($A13<=4,$A13<>0),0,IF($A13=\"S\",OFFSET(G13,-1,0)+1,OFFSET(G13,-1,0)))","v":0},{"$f":"IF(OR($A13=\"S\",$A13=0),0,MATCH(0,OFFSET($B13,1,$A13,ROW($A$142)-ROW($A13)),0))","v":129},{"$f":"IF(OR($A13=\"S\",$A13=0),0,MATCH(OFFSET($B13,0,$A13)+1,OFFSET($B13,1,$A13,ROW($A$142)-ROW($A13)),0))","v":{"$error":"#N/A"}},"Meta",{"$f":"IF($A13=0,\"-\",CONCATENATE(C13&\".\",IF(AND($A$5>=2,$A13>=2),D13&\".\",\"\"),IF(AND($A$5>=3,$A13>=3),E13&\".\",\"\"),IF(AND($A$5>=4,$A13>=4),F13&\".\",\"\"),IF($A13=\"S\",G13&\".\",\"\")))","v":"1."},null,null," RESIDÊNCIA POPULAR UNIFAMILIARES EM MADEIRA","",{"$f":"OFFSET(PLQ!$E$12,ROW($P13)-ROW(P$12),0)","v":0},null,"BDI 1",{"$f":"IF($A13=\"S\",IF($Q$10=\"Preço Unitário (R$)\",PO.CustoUnitario,ROUND(PO.CustoUnitario*(1+$Z13),15-13*$X$6)),0)","v":0},{"$f":"IF($A13=\"S\",VTOTAL1,IF($A13=0,0,ROUND(SomaAgrup,15-13*$X$7)))","v":91360.2},{"$f":"IF($J13=\"\",\"\",IF($N13=\"\",\"DESCRIÇÃO\",IF(AND($J13=\"Serviço\",$O13=\"\"),\"UNIDADE\",IF($T13<=0,\"SEM VALOR\",IF(AND($Y13<>\"\",$Q13>$Y13),\"ACIMA REF.\",\"\")))))","v":""},{"$f":"IF(OR($A13=0,$A13=\"S\",$A13>CFF!$A$9),\"\",MAX(V$12:OFFSET(V13,-1,0))+1)","v":1},{"$f":"IF(AND($J13=\"Serviço\",$M13<>\"\"),IF($L13=\"\",$M13,CONCATENATE($L13,\"-\",$M13)))","v":false},{"$f":"IF(AND(Fonte<>\"\",Código<>\"\"),MATCH(Fonte&\" \"&IF(Fonte=\"sinapi\",SUBSTITUTE(SUBSTITUTE(Código,\"/00\",\"/\"),\"/0\",\"/\"),Código),INDIRECT(\"'[Referência \"&_xlnm.Database&\".xls]Banco'!$a:$a\"),0),\"X\")","v":"X"},{"$f":"IF(Import.Desoneracao=\"sim\",Referencia.Desonerado,Referencia.NaoDesonerado)","v":0},{"$f":"ROUND(IF(ISNUMBER(R13),R13,IF(LEFT(R13,3)=\"BDI\",HLOOKUP(R13,DADOS!$T$37:$X$38,2,FALSE),0)),15-11*$X$5)","v":0.26379999999999998}]
[2,3,1,1,0,0,0,128,3,"Nível 2","1.1.",null,null,"SERVIÇOS PRELIMINARES",{"$f":"Referencia.Unidade","v":""},{"$f":"OFFSET(PLQ!$E$12,ROW($P14)-ROW(P$12),0)","v":0},null,"BDI 1",0,3555.62,"",{"$f":"IF(OR($A14=0,$A14=\"S\",$A14>CFF!$A$9),\"\",MAX(V$12:OFFSET(V14,-1,0))+1)","v":2},false,"X",0,{"$f":"ROUND(IF(ISNUMBER(R14),R14,IF(LEFT(R14,3)=\"BDI\",HLOOKUP(R14,DADOS!$T$37:$X$38,2,FALSE),0)),15-11*$X$5)","v":0.26379999999999998}]
["S",0,1,1,0,0,1,0,0,"Serviço","1.1.1.","SINAPI","101489",{"$f":"IF($A15=\"S\",Referencia.Descricao,\"(digite a descrição aqui)\")","v":"ENTRADA DE ENERGIA ELÉTRICA, AÉREA, MONOFÁSICA, COM CAIXA DE SOBREPOR, CABO DE 10 MM2 E DISJUNTOR DIN 50A (NÃO INCLUSO O POSTE DE CONCRETO). AF_07/2020_PS"},{"$f":"Referencia.Unidade","v":"UN"},{"$f":"OFFSET(PLQ!$E$12,ROW($P15)-ROW(P$12),0)","v":1},1403.73,"BDI 1",1774.03,1774.03,"",{"$f":"IF(OR($A15=0,$A15=\"S\",$A15>CFF!$A$9),\"\",MAX(V$12:OFFSET(V15,-1,0))+1)","v":""},"SINAPI-101489",3125,1403.73,{"$f":"ROUND(IF(ISNUMBER(R15),R15,IF(LEFT(R15,3)=\"BDI\",HLOOKUP(R15,DADOS!$T$37:$X$38,2,FALSE),0)),15-11*$X$5)","v":0.26379999999999998}]
["S",0,1,1,0,0,2,0,0,"Serviço","1.1.2.","SINAPI-I","12366","POSTE DE CONCRETO ARMADO DE SECAO CIRCULAR, EXTENSAO DE 10,00 M, RESISTENCIA DE 150 A 200 DAN, TIPO C-14",{"$f":"Referencia.Unidade","v":"UN    "},{"$f":"OFFSET(PLQ!$E$12,ROW($P16)-ROW(P$12),0)","v":1},1409.71,"BDI 1",1781.59,1781.59,"",{"$f":"IF(OR($A16=0,$A16=\"S\",$A16>CFF!$A$9),\"\",MAX(V$12:OFFSET(V16,-1,0))+1)","v":""},"SINAPI-I-12366",11082,1409.71,{"$f":"ROUND(IF(ISNUMBER(R16),R16,IF(LEFT(R16,3)=\"BDI\",HLOOKUP(R16,DADOS!$T$37:$X$38,2,FALSE),0)),15-11*$X$5)","v":0.26379999999999998}]
[2,11,1,2,0,0,0,125,11,"Nível 2","1.2.",null,null,"INFRAESTRUTURA",{"$f":"Referencia.Unidade","v":""},{"$f":"OFFSET(PLQ!$E$12,ROW($P17)-ROW(P$12),0)","v":0},null,"BDI 1",0,10972.2,"",{"$f":"IF(OR($A17=0,$A17=\"S\",$A17>CFF!$A$9),\"\",MAX(V$12:OFFSET(V17,-1,0))+1)","v":3},false,"X",0,{"$f":"ROUND(IF(ISNUMBER(R17),R17,IF(LEFT(R17,3)=\"BDI\",HLOOKUP(R17,DADOS!$T$37:$X$38,2,FALSE),0)),15-11*$X$5)","v":0.26379999999999998}]
["S",0,1,2,0,0,1,0,0,"Serviço","1.2.1.","SINAPI","96527","ESCAVAÇÃO MANUAL DE VALA PARA VIGA BALDRAME (INCLUINDO ESCAVAÇÃO PARA COLOCAÇÃO DE FÔRMAS). AF_06/2017",{"$f":"Referencia.Unidade","v":"M3"},{"$f":"OFFSET(PLQ!$E$12,ROW($P18)-ROW(P$12),0)","v":4.45},112.54,"BDI 1",142.22999999999999,632.91999999999996,"",{"$f":"IF(OR($A18=0,$A18=\"S\",$A18>CFF!$A$9),\"\",MAX(V$12:OFFSET(V18,-1,0))+1)","v":""},"SINAPI-96527",5495,112.54,{"$f":"ROUND(IF(ISNUMBER(R18),R18,IF(LEFT(R18,3)=\"BDI\",HLOOKUP(R18,DADOS!$T$37:$X$38,2,FALSE),0)),15-11*$X$5)","v":0.26379999999999998}]
["S",0,1,2,0,0,2,0,0,"Serviço","1.2.2.","SINAPI","102487","CONCRETO CICLÓPICO FCK = 15MPA, 30% PEDRA DE MÃO EM VOLUME REAL, INCLUSIVE LANÇAMENTO. AF_05/2021",{"$f":"Referencia.Unidade","v":"M3"},{"$f":"OFFSET(PLQ!$E$12,ROW($P19)-ROW(P$12),0)","v":1.48},521.96,"BDI 1",659.65,976.28,"",{"$f":"IF(OR($A19=0,$A19=\"S\",$A19>CFF!$A$9),\"\",MAX(V$12:OFFSET(V19,-1,0))+1)","v":""},"SINAPI-102487",2590,521.96,{"$f":"ROUND(IF(ISNUMBER(R19),R19,IF(LEFT(R19,3)=\"BDI\",HLOOKUP(R19,DADOS!$T$37:$X$38,2,FALSE),0)),15-11*$X$5)","v":0.26379999999999998}]
["S",0,1,2,0,0,3,0,0,"Serviço","1.2.3.","SINAPI","101159","ALVENARIA DE VEDAÇÃO DE BLOCOS CERÂMICOS MACIÇOS DE 5X10X20CM (ESPESSURA 10CM) E ARGAMASSA DE ASSENTAMENTO COM PREPARO EM BETONEIRA. AF_05/2020",{"$f":"Referencia.Unidade","v":"M2"},{"$f":"OFFSET(PLQ!$E$12,ROW($P20)-ROW(P$12),0)","v":10.18},127.09,"BDI 1",160.62,1635.11,"",{"$f":"IF(OR($A20=0,$A20=\"S\",$A20>CFF!$A$9),\"\",MAX(V$12:OFFSET(V20,-1,0))+1)","v":""},"SINAPI-101159",5751,127.09,{"$f":"ROUND(IF(ISNUMBER(R20),R20,IF(LEFT(R20,3)=\"BDI\",HLOOKUP(R20,DADOS!$T$37:$X$38,2,FALSE),0)),15-11*$X$5)","v":0.26379999999999998}]
["S",0,1,2,0,0,4,0,0,"Serviço","1.2.4.","SINAPI","96533","FABRICAÇÃO, MONTAGEM E DESMONTAGEM DE FÔRMA PARA VIGA BALDRAME, EM MADEIRA SERRADA, E=25 MM, 2 UTILIZAÇÕES. AF_06/2017",{"$f":"Referencia.Unidade","v":"M2"},{"$f":"OFFSET(PLQ!$E$12,ROW($P21)-ROW(P$12),0)","v":14.82},84.61,"BDI 1",106.93,1584.7,"",{"$f":"IF(OR($A21=0,$A21=\"S\",$A21>CFF!$A$9),\"\",MAX(V$12:OFFSET(V21,-1,0))+1)","v":""},"SINAPI-96533",2325,84.61,{"$f":"ROUND(IF(ISNUMBER(R21),R21,IF(LEFT(R21,3)=\"BDI\",HLOOKUP(R21,DADOS!$T$37:$X$38,2,FALSE),0)),15-11*$X$5)","v":0.26379999999999998}]
["S",0,1,2,0,0,5,0,0,"Serviço","1.2.5.","SINAPI","94965","CONCRETO FCK = 25MPA, TRAÇO 1:2,3:2,7 (EM MASSA SECA DE CIMENTO/ AREIA MÉDIA/ BRITA 1) - PREPARO MECÂNICO COM BETONEIRA 400 L. AF_05/2021",{"$f":"Referencia.Unidade","v":"M3"},{"$f":"OFFSET(PLQ!$E$12,ROW($P22)-ROW(P$12),0)","v":2.96},473.64,"BDI 1",598.59,1771.83,"",{"$f":"IF(OR($A22=0,$A22=\"S\",$A22>CFF!$A$9),\"\",MAX(V$12:OFFSET(V22,-1,0))+1)","v":""},"SINAPI-94965",2551,473.64,{"$f":"ROUND(IF(ISNUMBER(R22),R22,IF(LEFT(R22,3)=\"BDI\",HLOOKUP(R22,DADOS!$T$37:$X$38,2,FALSE),0)),15-11*$X$5)","v":0.26379999999999998}]
["S",0,1,2,0,0,6,0,0,"Serviço","1.2.6.","SINAPI","103670","LANÇAMENTO COM USO DE BALDES, ADENSAMENTO E ACABAMENTO DE CONCRETO EM ESTRUTURAS. AF_02/2022",{"$f":"Referencia.Unidade","v":"M3"},{"$f":"OFFSET(PLQ!$E$12,ROW($P23)-ROW(P$12),0)","v":2.96},255.08,"BDI 1",322.37,954.22,"",{"$f":"IF(OR($A23=0,$A23=\"S\",$A23>CFF!$A$9),\"\",MAX(V$12:OFFSET(V23,-1,0))+1)","v":""},"SINAPI-103670",2594,255.08,{"$f":"ROUND(IF(ISNUMBER(R23),R23,IF(LEFT(R23,3)=\"BDI\",HLOOKUP(R23,DADOS!$T$37:$X$38,2,FALSE),0)),15-11*$X$5)","v":0.26379999999999998}]
["S",0,1,2,0,0,7,0,0,"Serviço","1.2.7.","SINAPI","92919","ARMAÇÃO DE ESTRUTURAS DIVERSAS DE CONCRETO ARMADO, EXCETO VIGAS, PILARES, LAJES E FUNDAÇÕES, UTILIZANDO AÇO CA-50 DE 10,0 MM - MONTAGEM. AF_06/2022",{"$f":"Referencia.Unidade","v":"KG"},{"$f":"OFFSET(PLQ!$E$12,ROW($P24)-ROW(P$12),0)","v":37.380000000000003},12.52,"BDI 1",15.82,591.35,"",{"$f":"IF(OR($A24=0,$A24=\"S\",$A24>CFF!$A$9),\"\",MAX(V$12:OFFSET(V24,-1,0))+1)","v":""},"SINAPI-92919",2490,12.52,{"$f":"ROUND(IF(ISNUMBER(R24),R24,IF(LEFT(R24,3)=\"BDI\",HLOOKUP(R24,DADOS!$T$37:$X$38,2,FALSE),0)),15-11*$X$5)","v":0.26379999999999998}]
["S",0,1,2,0,0,8,0,0,"Serviço","1.2.8.","SINAPI","92917","ARMAÇÃO DE ESTRUTURAS DIVERSAS DE CONCRETO ARMADO, EXCETO VIGAS, PILARES, LAJES E FUNDAÇÕES, UTILIZANDO AÇO CA-50 DE 8,0 MM - MONTAGEM. AF_06/2022",{"$f":"Referencia.Unidade","v":"KG"},{"$f":"OFFSET(PLQ!$E$12,ROW($P25)-ROW(P$12),0)","v":9.76},14.12,"BDI 1",17.84,174.12,"",{"$f":"IF(OR($A25=0,$A25=\"S\",$A25>CFF!$A$9),\"\",MAX(V$12:OFFSET(V25,-1,0))+1)","v":""},"SINAPI-92917",2489,14.12,{"$f":"ROUND(IF(ISNUMBER(R25),R25,IF(LEFT(R25,3)=\"BDI\",HLOOKUP(R25,DADOS!$T$37:$X$38,2,FALSE),0)),15-11*$X$5)","v":0.26379999999999998}]
["S",0,1,2,0,0,9,0,0,"Serviço","1.2.9.","SINAPI","92915","ARMAÇÃO DE ESTRUTURAS DIVERSAS DE CONCRETO ARMADO, EXCETO VIGAS, PILARES, LAJES E FUNDAÇÕES, UTILIZANDO AÇO CA-60 DE 5,0 MM - MONTAGEM. AF_06/2022",{"$f":"Referencia.Unidade","v":"KG"},{"$f":"OFFSET(PLQ!$E$12,ROW($P26)-ROW(P$12),0)","v":10.39},16.21,"BDI 1",20.49,212.89,"",{"$f":"IF(OR($A26=0,$A26=\"S\",$A26>CFF!$A$9),\"\",MAX(V$12:OFFSET(V26,-1,0))+1)","v":""},"SINAPI-92915",2487,16.21,{"$f":"ROUND(IF(ISNUMBER(R26),R26,IF(LEFT(R26,3)=\"BDI\",HLOOKUP(R26,DADOS!$T$37:$X$38,2,FALSE),0)),15-11*$X$5)","v":0.26379999999999998}]
["S",0,1,2,0,0,10,0,0,"Serviço","1.2.10.","SINAPI","98557","IMPERMEABILIZAÇÃO DE SUPERFÍCIE COM EMULSÃO ASFÁLTICA, 2 DEMÃOS AF_06/2018",{"$f":"Referencia.Unidade","v":"M2"},{"$f":"OFFSET(PLQ!$E$12,ROW($P27)-ROW(P$12),0)","v":39.520000000000003},48.83,"BDI 1",61.71,2438.7800000000002,"",{"$f":"IF(OR($A27=0,$A27=\"S\",$A27>CFF!$A$9),\"\",MAX(V$12:OFFSET(V27,-1,0))+1)","v":""},"SINAPI-98557",2732,48.83,{"$f":"ROUND(IF(ISNUMBER(R27),R27,IF(LEFT(R27,3)=\"BDI\",HLOOKUP(R27,DADOS!$T$37:$X$38,2,FALSE),0)),15-11*$X$5)","v":0.26379999999999998}]
[2,11,1,3,0,0,0,114,11,"Nível 2","1.3.",null,null,"SUPRAESTRUTURA",{"$f":"Referencia.Unidade","v":""},{"$f":"OFFSET(PLQ!$E$12,ROW($P28)-ROW(P$12),0)","v":0},null,"BDI 1",0,6468.63,"",{"$f":"IF(OR($A28=0,$A28=\"S\",$A28>CFF!$A$9),\"\",MAX(V$12:OFFSET(V28,-1,0))+1)","v":4},false,"X",0,{"$f":"ROUND(IF(ISNUMBER(R28),R28,IF(LEFT(R28,3)=\"BDI\",HLOOKUP(R28,DADOS!$T$37:$X$38,2,FALSE),0)),15-11*$X$5)","v":0.26379999999999998}]
["S",0,1,3,0,0,1,0,0,"Serviço","1.3.1.","SINAPI","94965","CONCRETO FCK = 25MPA, TRAÇO 1:2,3:2,7 (EM MASSA SECA DE CIMENTO/ AREIA MÉDIA/ BRITA 1) - PREPARO MECÂNICO COM BETONEIRA 400 L. AF_05/2021",{"$f":"Referencia.Unidade","v":"M3"},{"$f":"OFFSET(PLQ!$E$12,ROW($P29)-ROW(P$12),0)","v":1.49},473.64,"BDI 1",598.59,891.9,"",{"$f":"IF(OR($A29=0,$A29=\"S\",$A29>CFF!$A$9),\"\",MAX(V$12:OFFSET(V29,-1,0))+1)","v":""},"SINAPI-94965",2551,473.64,{"$f":"ROUND(IF(ISNUMBER(R29),R29,IF(LEFT(R29,3)=\"BDI\",HLOOKUP(R29,DADOS!$T$37:$X$38,2,FALSE),0)),15-11*$X$5)","v":0.26379999999999998}]
["S",0,1,3,0,0,2,0,0,"Serviço","1.3.2.","SINAPI","103670","LANÇAMENTO COM USO DE BALDES, ADENSAMENTO E ACABAMENTO DE CONCRETO EM ESTRUTURAS. AF_02/2022",{"$f":"Referencia.Unidade","v":"M3"},{"$f":"OFFSET(PLQ!$E$12,ROW($P30)-ROW(P$12),0)","v":1.49},255.08,"BDI 1",322.37,480.33,"",{"$f":"IF(OR($A30=0,$A30=\"S\",$A30>CFF!$A$9),\"\",MAX(V$12:OFFSET(V30,-1,0))+1)","v":""},"SINAPI-103670",2594,255.08,{"$f":"ROUND(IF(ISNUMBER(R30),R30,IF(LEFT(R30,3)=\"BDI\",HLOOKUP(R30,DADOS!$T$37:$X$38,2,FALSE),0)),15-11*$X$5)","v":0.26379999999999998}]
["S",0,1,3,0,0,3,0,0,"Serviço","1.3.3.","SINAPI","96533","FABRICAÇÃO, MONTAGEM E DESMONTAGEM DE FÔRMA PARA VIGA BALDRAME, EM MADEIRA SERRADA, E=25 MM, 2 UTILIZAÇÕES. AF_06/2017",{"$f":"Referencia.Unidade","v":"M2"},{"$f":"OFFSET(PLQ!$E$12,ROW($P31)-ROW(P$12),0)","v":12.95},84.61,"BDI 1",106.93,1384.74,"",{"$f":"IF(OR($A31=0,$A31=\"S\",$A31>CFF!$A$9),\"\",MAX(V$12:OFFSET(V31,-1,0))+1)","v":""},"SINAPI-96533",2325,84.61,{"$f":"ROUND(IF(ISNUMBER(R31),R31,IF(LEFT(R31,3)=\"BDI\",HLOOKUP(R31,DADOS!$T$37:$X$38,2,FALSE),0)),15-11*$X$5)","v":0.26379999999999998}]
[{"$f":"CHOOSE(1+LOG(1+2*(J32=\"Meta\")+4*(J32=\"Nível 2\")+8*(J32=\"Nível 3\")+16*(J32=\"Nível 4\")+32*(J32=\"Serviço\"),2),0,1,2,3,4,\"S\")","v":"S"},{"$f":"IF(OR(A32=\"S\",A32=0),0,IF(ISERROR(I32),H32,SMALL(H32:I32,1)))","v":0},{"$f":"IF($A32=1,OFFSET(C32,-1,0)+1,OFFSET(C32,-1,0))","v":1},{"$f":"IF($A32=1,0,IF($A32=2,OFFSET(D32,-1,0)+1,OFFSET(D32,-1,0)))","v":3},{"$f":"IF(AND($A32<=2,$A32<>0),0,IF($A32=3,OFFSET(E32,-1,0)+1,OFFSET(E32,-1,0)))","v":0},{"$f":"IF(AND($A32<=3,$A32<>0),0,IF($A32=4,OFFSET(F32,-1,0)+1,OFFSET(F32,-1,0)))","v":0},{"$f":"IF(AND($A32<=4,$A32<>0),0,IF($A32=\"S\",OFFSET(G32,-1,0)+1,OFFSET(G32,-1,0)))","v":4},0,0,"Serviço",{"$f":"IF($A32=0,\"-\",CONCATENATE(C32&\".\",IF(AND($A$5>=2,$A32>=2),D32&\".\",\"\"),IF(AND($A$5>=3,$A32>=3),E32&\".\",\"\"),IF(AND($A$5>=4,$A32>=4),F32&\".\",\"\"),IF($A32=\"S\",G32&\".\",\"\")))","v":"1.3.4."},"SINAPI","92919",{"$f":"IF($A32=\"S\",Referencia.Descricao,\"(digite a descrição aqui)\")","v":"ARMAÇÃO DE ESTRUTURAS DIVERSAS DE CONCRETO ARMADO, EXCETO VIGAS, PILARES, LAJES E FUNDAÇÕES, UTILIZANDO AÇO CA-50 DE 10,0 MM - MONTAGEM. AF_06/2022"},{"$f":"Referencia.Unidade","v":"KG"},{"$f":"OFFSET(PLQ!$E$12,ROW($P32)-ROW(P$12),0)","v":4.97},12.52,"BDI 1",{"$f":"IF($A32=\"S\",IF($Q$10=\"Preço Unitário (R$)\",PO.CustoUnitario,ROUND(PO.CustoUnitario*(1+$Z32),15-13*$X$6)),0)","v":15.82},{"$f":"IF($A32=\"S\",VTOTAL1,IF($A32=0,0,ROUND(SomaAgrup,15-13*$X$7)))","v":78.63},{"$f":"IF($J32=\"\",\"\",IF($N32=\"\",\"DESCRIÇÃO\",IF(AND($J32=\"Serviço\",$O32=\"\"),\"UNIDADE\",IF($T32<=0,\"SEM VALOR\",IF(AND($Y32<>\"\",$Q32>$Y32),\"ACIMA REF.\",\"\")))))","v":""},{"$f":"IF(OR($A32=0,$A32=\"S\",$A32>CFF!$A$9),\"\",MAX(V$12:OFFSET(V32,-1,0))+1)","v":""},{"$f":"IF(AND($J32=\"Serviço\",$M32<>\"\"),IF($L32=\"\",$M32,CONCATENATE($L32,\"-\",$M32)))","v":"SINAPI-92919"},{"$f":"IF(AND(Fonte<>\"\",Código<>\"\"),MATCH(Fonte&\" \"&IF(Fonte=\"sinapi\",SUBSTITUTE(SUBSTITUTE(Código,\"/00\",\"/\"),\"/0\",\"/\"),Código),INDIRECT(\"'[Referência \"&_xlnm.Database&\".xls]Banco'!$a:$a\"),0),\"X\")","v":2490},{"$f":"IF(Import.Desoneracao=\"sim\",Referencia.Desonerado,Referencia.NaoDesonerado)","v":12.52},{"$f":"ROUND(IF(ISNUMBER(R32),R32,IF(LEFT(R32,3)=\"BDI\",HLOOKUP(R32,DADOS!$T$37:$X$38,2,FALSE),0)),15-11*$X$5)","v":0.26379999999999998}]
[{"$f":"CHOOSE(1+LOG(1+2*(J33=\"Meta\")+4*(J33=\"Nível 2\")+8*(J33=\"Nível 3\")+16*(J33=\"Nível 4\")+32*(J33=\"Serviço\"),2),0,1,2,3,4,\"S\")","v":"S"},{"$f":"IF(OR(A33=\"S\",A33=0),0,IF(ISERROR(I33),H33,SMALL(H33:I33,1)))","v":0},{"$f":"IF($A33=1,OFFSET(C33,-1,0)+1,OFFSET(C33,-1,0))","v":1},{"$f":"IF($A33=1,0,IF($A33=2,OFFSET(D33,-1,0)+1,OFFSET(D33,-1,0)))","v":3},{"$f":"IF(AND($A33<=2,$A33<>0),0,IF($A33=3,OFFSET(E33,-1,0)+1,OFFSET(E33,-1,0)))","v":0},{"$f":"IF(AND($A33<=3,$A33<>0),0,IF($A33=4,OFFSET(F33,-1,0)+1,OFFSET(F33,-1,0)))","v":0},{"$f":"IF(AND($A33<=4,$A33<>0),0,IF($A33=\"S\",OFFSET(G33,-1,0)+1,OFFSET(G33,-1,0)))","v":5},0,0,"Serviço",{"$f":"IF($A33=0,\"-\",CONCATENATE(C33&\".\",IF(AND($A$5>=2,$A33>=2),D33&\".\",\"\"),IF(AND($A$5>=3,$A33>=3),E33&\".\",\"\"),IF(AND($A$5>=4,$A33>=4),F33&\".\",\"\"),IF($A33=\"S\",G33&\".\",\"\")))","v":"1.3.5."},"SINAPI","92917",{"$f":"IF($A33=\"S\",Referencia.Descricao,\"(digite a descrição aqui)\")","v":"ARMAÇÃO DE ESTRUTURAS DIVERSAS DE CONCRETO ARMADO, EXCETO VIGAS, PILARES, LAJES E FUNDAÇÕES, UTILIZANDO AÇO CA-50 DE 8,0 MM - MONTAGEM. AF_06/2022"},{"$f":"Referencia.Unidade","v":"KG"},{"$f":"OFFSET(PLQ!$E$12,ROW($P33)-ROW(P$12),0)","v":4.9400000000000004},14.12,"BDI 1",{"$f":"IF($A33=\"S\",IF($Q$10=\"Preço Unitário (R$)\",PO.CustoUnitario,ROUND(PO.CustoUnitario*(1+$Z33),15-13*$X$6)),0)","v":17.84},{"$f":"IF($A33=\"S\",VTOTAL1,IF($A33=0,0,ROUND(SomaAgrup,15-13*$X$7)))","v":88.13},{"$f":"IF($J33=\"\",\"\",IF($N33=\"\",\"DESCRIÇÃO\",IF(AND($J33=\"Serviço\",$O33=\"\"),\"UNIDADE\",IF($T33<=0,\"SEM VALOR\",IF(AND($Y33<>\"\",$Q33>$Y33),\"ACIMA REF.\",\"\")))))","v":""},{"$f":"IF(OR($A33=0,$A33=\"S\",$A33>CFF!$A$9),\"\",MAX(V$12:OFFSET(V33,-1,0))+1)","v":""},{"$f":"IF(AND($J33=\"Serviço\",$M33<>\"\"),IF($L33=\"\",$M33,CONCATENATE($L33,\"-\",$M33)))","v":"SINAPI-92917"},{"$f":"IF(AND(Fonte<>\"\",Código<>\"\"),MATCH(Fonte&\" \"&IF(Fonte=\"sinapi\",SUBSTITUTE(SUBSTITUTE(Código,\"/00\",\"/\"),\"/0\",\"/\"),Código),INDIRECT(\"'[Referência \"&_xlnm.Database&\".xls]Banco'!$a:$a\"),0),\"X\")","v":2489},{"$f":"IF(Import.Desoneracao=\"sim\",Referencia.Desonerado,Referencia.NaoDesonerado)","v":14.12},{"$f":"ROUND(IF(ISNUMBER(R33),R33,IF(LEFT(R33,3)=\"BDI\",HLOOKUP(R33,DADOS!$T$37:$X$38,2,FALSE),0)),15-11*$X$5)","v":0.26379999999999998}]
["S",0,1,3,0,0,6,0,0,"Serviço","1.3.6.","SINAPI","92915","ARMAÇÃO DE ESTRUTURAS DIVERSAS DE CONCRETO ARMADO, EXCETO VIGAS, PILARES, LAJES E FUNDAÇÕES, UTILIZANDO AÇO CA-60 DE 5,0 MM - MONTAGEM. AF_06/2022",{"$f":"Referencia.Unidade","v":"KG"},{"$f":"OFFSET(PLQ!$E$12,ROW($P34)-ROW(P$12),0)","v":9.4700000000000006},16.21,"BDI 1",20.49,194.04,"",{"$f":"IF(OR($A34=0,$A34=\"S\",$A34>CFF!$A$9),\"\",MAX(V$12:OFFSET(V34,-1,0))+1)","v":""},"SINAPI-92915",2487,16.21,{"$f":"ROUND(IF(ISNUMBER(R34),R34,IF(LEFT(R34,3)=\"BDI\",HLOOKUP(R34,DADOS!$T$37:$X$38,2,FALSE),0)),15-11*$X$5)","v":0.26379999999999998}]
["S",0,1,3,0,0,7,0,0,"Serviço","1.3.7.","SINAPI","93188","VERGA MOLDADA IN LOCO EM CONCRETO PARA PORTAS COM ATÉ 1,5 M DE VÃO. AF_03/2016",{"$f":"Referencia.Unidade","v":"M"},{"$f":"OFFSET(PLQ!$E$12,ROW($P35)-ROW(P$12),0)","v":2},64.23,"BDI 1",81.17,162.34,"",{"$f":"IF(OR($A35=0,$A35=\"S\",$A35>CFF!$A$9),\"\",MAX(V$12:OFFSET(V35,-1,0))+1)","v":""},"SINAPI-93188",2626,64.23,{"$f":"ROUND(IF(ISNUMBER(R35),R35,IF(LEFT(R35,3)=\"BDI\",HLOOKUP(R35,DADOS!$T$37:$X$38,2,FALSE),0)),15-11*$X$5)","v":0.26379999999999998}]
["S",0,1,3,0,0,8,0,0,"Serviço","1.3.8.","SINAPI","93186","VERGA MOLDADA IN LOCO EM CONCRETO PARA JANELAS COM ATÉ 1,5 M DE VÃO. AF_03/2016",{"$f":"Referencia.Unidade","v":"M"},{"$f":"OFFSET(PLQ!$E$12,ROW($P36)-ROW(P$12),0)","v":2.5},68.53,"BDI 1",86.61,216.53,"",{"$f":"IF(OR($A36=0,$A36=\"S\",$A36>CFF!$A$9),\"\",MAX(V$12:OFFSET(V36,-1,0))+1)","v":""},"SINAPI-93186",2624,68.53,{"$f":"ROUND(IF(ISNUMBER(R36),R36,IF(LEFT(R36,3)=\"BDI\",HLOOKUP(R36,DADOS!$T$37:$X$38,2,FALSE),0)),15-11*$X$5)","v":0.26379999999999998}]
["S",0,1,3,0,0,9,0,0,"Serviço","1.3.9.","SINAPI","93196","CONTRAVERGA MOLDADA IN LOCO EM CONCRETO PARA VÃOS DE ATÉ 1,5 M DE COMPRIMENTO. AF_03/2016",{"$f":"Referencia.Unidade","v":"M"},{"$f":"OFFSET(PLQ!$E$12,ROW($P37)-ROW(P$12),0)","v":2.5},66.2,"BDI 1",83.66,209.15,"",{"$f":"IF(OR($A37=0,$A37=\"S\",$A37>CFF!$A$9),\"\",MAX(V$12:OFFSET(V37,-1,0))+1)","v":""},"SINAPI-93196",2634,66.2,{"$f":"ROUND(IF(ISNUMBER(R37),R37,IF(LEFT(R37,3)=\"BDI\",HLOOKUP(R37,DADOS!$T$37:$X$38,2,FALSE),0)),15-11*$X$5)","v":0.26379999999999998}]
["S",0,1,3,0,0,10,0,0,"Serviço","1.3.10.","COTAÇÃO","01","CAIBRO 5X7cm  EM MADEIRA DE PINHO BRASILEIRO",{"$f":"Referencia.Unidade","v":"m"},{"$f":"OFFSET(PLQ!$E$12,ROW($P38)-ROW(P$12),0)","v":186.05},11.75,"BDI 1",14.85,2762.84,"",{"$f":"IF(OR($A38=0,$A38=\"S\",$A38>CFF!$A$9),\"\",MAX(V$12:OFFSET(V38,-1,0))+1)","v":""},"COTAÇÃO-01",22,11.75,{"$f":"ROUND(IF(ISNUMBER(R38),R38,IF(LEFT(R38,3)=\"BDI\",HLOOKUP(R38,DADOS!$T$37:$X$38,2,FALSE),0)),15-11*$X$5)","v":0.26379999999999998}]
[2,11,1,4,0,0,0,103,11,"Nível 2","1.4.",null,null,"PAREDE",{"$f":"Referencia.Unidade","v":""},{"$f":"OFFSET(PLQ!$E$12,ROW($P39)-ROW(P$12),0)","v":0},null,"BDI 1",0,24441.94,"",{"$f":"IF(OR($A39=0,$A39=\"S\",$A39>CFF!$A$9),\"\",MAX(V$12:OFFSET(V39,-1,0))+1)","v":5},false,"X",0,{"$f":"ROUND(IF(ISNUMBER(R39),R39,IF(LEFT(R39,3)=\"BDI\",HLOOKUP(R39,DADOS!$T$37:$X$38,2,FALSE),0)),15-11*$X$5)","v":0.26379999999999998}]
["S",0,1,4,0,0,1,0,0,"Serviço","1.4.1.","SINAPI","103330","ALVENARIA DE VEDAÇÃO DE BLOCOS CERÂMICOS FURADOS NA HORIZONTAL DE 11,5X19X19 CM (ESPESSURA 11,5 CM) E ARGAMASSA DE ASSENTAMENTO COM PREPARO EM BETONEIRA. AF_12/2021",{"$f":"Referencia.Unidade","v":"M2"},{"$f":"OFFSET(PLQ!$E$12,ROW($P40)-ROW(P$12),0)","v":32.159999999999997},76.239999999999995,"BDI 1",96.35,3098.62,"",{"$f":"IF(OR($A40=0,$A40=\"S\",$A40>CFF!$A$9),\"\",MAX(V$12:OFFSET(V40,-1,0))+1)","v":""},"SINAPI-103330",5760,76.239999999999995,{"$f":"ROUND(IF(ISNUMBER(R40),R40,IF(LEFT(R40,3)=\"BDI\",HLOOKUP(R40,DADOS!$T$37:$X$38,2,FALSE),0)),15-11*$X$5)","v":0.26379999999999998}]
["S",0,1,4,0,0,2,0,0,"Serviço","1.4.2.","COTAÇÃO","03","PAREDE DE EUCALIPTO",{"$f":"Referencia.Unidade","v":"m2"},{"$f":"OFFSET(PLQ!$E$12,ROW($P41)-ROW(P$12),0)","v":40.380000000000003},90,"BDI 1",113.74,4592.82,"",{"$f":"IF(OR($A41=0,$A41=\"S\",$A41>CFF!$A$9),\"\",MAX(V$12:OFFSET(V41,-1,0))+1)","v":""},"COTAÇÃO-03",24,90,{"$f":"ROUND(IF(ISNUMBER(R41),R41,IF(LEFT(R41,3)=\"BDI\",HLOOKUP(R41,DADOS!$T$37:$X$38,2,FALSE),0)),15-11*$X$5)","v":0.26379999999999998}]
["S",0,1,4,0,0,3,0,0,"Serviço","1.4.3.","COTAÇÃO","02","FORRO DE PINUS",{"$f":"Referencia.Unidade","v":"m2"},{"$f":"OFFSET(PLQ!$E$12,ROW($P42)-ROW(P$12),0)","v":63.54},30,"BDI 1",37.909999999999997,2408.8000000000002,"",{"$f":"IF(OR($A42=0,$A42=\"S\",$A42>CFF!$A$9),\"\",MAX(V$12:OFFSET(V42,-1,0))+1)","v":""},"COTAÇÃO-02",23,30,{"$f":"ROUND(IF(ISNUMBER(R42),R42,IF(LEFT(R42,3)=\"BDI\",HLOOKUP(R42,DADOS!$T$37:$X$38,2,FALSE),0)),15-11*$X$5)","v":0.26379999999999998}]
["S",0,1,4,0,0,4,0,0,"Serviço","1.4.4.","SINAPI","91320","KIT DE PORTA DE MADEIRA PARA PINTURA, SEMI-OCA (LEVE OU MÉDIA), PADRÃO POPULAR, 80X210CM, ESPESSURA DE 3,5CM, ITENS INCLUSOS: DOBRADIÇAS, MONTAGEM E INSTALAÇÃO DO BATENTE, SEM FECHADURA - FORNECIMENTO E INSTALAÇÃO. AF_12/2019",{"$f":"Referencia.Unidade","v":"UN"},{"$f":"OFFSET(PLQ!$E$12,ROW($P43)-ROW(P$12),0)","v":3},900,"BDI 1",1137.42,3412.26,"",{"$f":"IF(OR($A43=0,$A43=\"S\",$A43>CFF!$A$9),\"\",MAX(V$12:OFFSET(V43,-1,0))+1)","v":""},"SINAPI-91320",2008,900.33,{"$f":"ROUND(IF(ISNUMBER(R43),R43,IF(LEFT(R43,3)=\"BDI\",HLOOKUP(R43,DADOS!$T$37:$X$38,2,FALSE),0)),15-11*$X$5)","v":0.26379999999999998}]
["S",0,1,4,0,0,5,0,0,"Serviço","1.4.5.","SINAPI","91320","KIT DE PORTA DE MADEIRA PARA PINTURA, SEMI-OCA (LEVE OU MÉDIA), PADRÃO POPULAR, 80X210CM, ESPESSURA DE 3,5CM, ITENS INCLUSOS: DOBRADIÇAS, MONTAGEM E INSTALAÇÃO DO BATENTE, SEM FECHADURA - FORNECIMENTO E INSTALAÇÃO. AF_12/2019",{"$f":"Referencia.Unidade","v":"UN"},{"$f":"OFFSET(PLQ!$E$12,ROW($P44)-ROW(P$12),0)","v":1},900,"BDI 1",1137.42,1137.42,"",{"$f":"IF(OR($A44=0,$A44=\"S\",$A44>CFF!$A$9),\"\",MAX(V$12:OFFSET(V44,-1,0))+1)","v":""},"SINAPI-91320",2008,900.33,{"$f":"ROUND(IF(ISNUMBER(R44),R44,IF(LEFT(R44,3)=\"BDI\",HLOOKUP(R44,DADOS!$T$37:$X$38,2,FALSE),0)),15-11*$X$5)","v":0.26379999999999998}]
["S",0,1,4,0,0,6,{"$f":"IF(OR($A45=\"S\",$A45=0),0,MATCH(0,OFFSET($B45,1,$A45,ROW($A$142)-ROW($A45)),0))","v":0},{"$f":"IF(OR($A45=\"S\",$A45=0),0,MATCH(OFFSET($B45,0,$A45)+1,OFFSET($B45,1,$A45,ROW($A$142)-ROW($A45)),0))","v":0},"Serviço","1.4.6.","SINAPI","91321","KIT DE PORTA DE MADEIRA PARA PINTURA, SEMI-OCA (LEVE OU MÉDIA), PADRÃO POPULAR, 90X210CM, ESPESSURA DE 3,5CM, ITENS INCLUSOS: DOBRADIÇAS, MONTAGEM E INSTALAÇÃO DO BATENTE, SEM FECHADURA - FORNECIMENTO E INSTALAÇÃO. AF_12/2019",{"$f":"Referencia.Unidade","v":"UN"},{"$f":"OFFSET(PLQ!$E$12,ROW($P45)-ROW(P$12),0)","v":1},1001.78,"BDI 1",1266.05,1266.05,"",{"$f":"IF(OR($A45=0,$A45=\"S\",$A45>CFF!$A$9),\"\",MAX(V$12:OFFSET(V45,-1,0))+1)","v":""},"SINAPI-91321",2009,1001.78,{"$f":"ROUND(IF(ISNUMBER(R45),R45,IF(LEFT(R45,3)=\"BDI\",HLOOKUP(R45,DADOS!$T$37:$X$38,2,FALSE),0)),15-11*$X$5)","v":0.26379999999999998}]
["S",0,1,4,0,0,7,0,0,"Serviço","1.4.7.","SINAPI","100669","JANELA DE MADEIRA (PINUS/EUCALIPTO OU EQUIV.) TIPO BASCULANTE COM 2 FOLHAS PARA VIDRO, COM BATENTE, ALIZAR E FERRAGENS. EXCLUSIVE VIDROS, ACABAMENTO E CONTRAMARCO. FORNECIMENTO E INSTALAÇÃO. AF_12/2019",{"$f":"Referencia.Unidade","v":"M2"},{"$f":"OFFSET(PLQ!$E$12,ROW($P46)-ROW(P$12),0)","v":0.25},1016.71,"BDI 1",1284.92,321.23,"",{"$f":"IF(OR($A46=0,$A46=\"S\",$A46>CFF!$A$9),\"\",MAX(V$12:OFFSET(V46,-1,0))+1)","v":""},"SINAPI-100669",2058,1016.71,{"$f":"ROUND(IF(ISNUMBER(R46),R46,IF(LEFT(R46,3)=\"BDI\",HLOOKUP(R46,DADOS!$T$37:$X$38,2,FALSE),0)),15-11*$X$5)","v":0.26379999999999998}]
["S",0,1,4,0,0,8,0,0,"Serviço","1.4.8.","SINAPI","102152","INSTALAÇÃO DE VIDRO LISO, E = 4 MM, EM ESQUADRIA DE MADEIRA, FIXADO COM BAGUETE. AF_01/2021",{"$f":"Referencia.Unidade","v":"M2"},{"$f":"OFFSET(PLQ!$E$12,ROW($P47)-ROW(P$12),0)","v":0.21},149.83000000000001,"BDI 1",189.36,39.770000000000003,"",{"$f":"IF(OR($A47=0,$A47=\"S\",$A47>CFF!$A$9),\"\",MAX(V$12:OFFSET(V47,-1,0))+1)","v":""},"SINAPI-102152",2092,149.83000000000001,{"$f":"ROUND(IF(ISNUMBER(R47),R47,IF(LEFT(R47,3)=\"BDI\",HLOOKUP(R47,DADOS!$T$37:$X$38,2,FALSE),0)),15-11*$X$5)","v":0.26379999999999998}]
["S",0,1,4,0,0,9,0,0,"Serviço","1.4.9.","SINAPI","100666","JANELA DE MADEIRA (PINUS/EUCALIPTO OU EQUIV.) DE ABRIR COM 4 FOLHAS (2 VENEZIANAS E 2 GUILHOTINAS PARA VIDRO), COM BATENTE, ALIZAR E FERRAGENS. EXCLUSIVE VIDROS, ACABAMENTO E CONTRAMARCO. FORNECIMENTO E INSTALAÇÃO. AF_12/2019",{"$f":"Referencia.Unidade","v":"M2"},{"$f":"OFFSET(PLQ!$E$12,ROW($P48)-ROW(P$12),0)","v":6.6},851.53,"BDI 1",1076.1600000000001,7102.66,"",{"$f":"IF(OR($A48=0,$A48=\"S\",$A48>CFF!$A$9),\"\",MAX(V$12:OFFSET(V48,-1,0))+1)","v":""},"SINAPI-100666",2055,851.53,{"$f":"ROUND(IF(ISNUMBER(R48),R48,IF(LEFT(R48,3)=\"BDI\",HLOOKUP(R48,DADOS!$T$37:$X$38,2,FALSE),0)),15-11*$X$5)","v":0.26379999999999998}]
["S",0,1,4,0,0,10,0,0,"Serviço","1.4.10.","SINAPI","102152","INSTALAÇÃO DE VIDRO LISO, E = 4 MM, EM ESQUADRIA DE MADEIRA, FIXADO COM BAGUETE. AF_01/2021",{"$f":"Referencia.Unidade","v":"M2"},{"$f":"OFFSET(PLQ!$E$12,ROW($P49)-ROW(P$12),0)","v":5.61},149.83000000000001,"BDI 1",189.36,1062.31,"",{"$f":"IF(OR($A49=0,$A49=\"S\",$A49>CFF!$A$9),\"\",MAX(V$12:OFFSET(V49,-1,0))+1)","v":""},"SINAPI-102152",2092,149.83000000000001,{"$f":"ROUND(IF(ISNUMBER(R49),R49,IF(LEFT(R49,3)=\"BDI\",HLOOKUP(R49,DADOS!$T$37:$X$38,2,FALSE),0)),15-11*$X$5)","v":0.26379999999999998}]
[2,9,1,5,0,0,0,92,9,"Nível 2","1.5.",null,null,"REVESTIMENTOS",{"$f":"Referencia.Unidade","v":""},{"$f":"OFFSET(PLQ!$E$12,ROW($P50)-ROW(P$12),0)","v":0},null,"BDI 1",0,9537.3700000000008,"",{"$f":"IF(OR($A50=0,$A50=\"S\",$A50>CFF!$A$9),\"\",MAX(V$12:OFFSET(V50,-1,0))+1)","v":6},false,"X",0,{"$f":"ROUND(IF(ISNUMBER(R50),R50,IF(LEFT(R50,3)=\"BDI\",HLOOKUP(R50,DADOS!$T$37:$X$38,2,FALSE),0)),15-11*$X$5)","v":0.26379999999999998}]
["S",0,1,5,0,0,1,0,0,"Serviço","1.5.1.","SINAPI","87878","CHAPISCO APLICADO EM ALVENARIAS E ESTRUTURAS DE CONCRETO INTERNAS, COM COLHER DE PEDREIRO.  ARGAMASSA TRAÇO 1:3 COM PREPARO MANUAL. AF_10/2022",{"$f":"Referencia.Unidade","v":"M2"},{"$f":"OFFSET(PLQ!$E$12,ROW($P51)-ROW(P$12),0)","v":43.91},4.3600000000000003,"BDI 1",5.51,241.94,"",{"$f":"IF(OR($A51=0,$A51=\"S\",$A51>CFF!$A$9),\"\",MAX(V$12:OFFSET(V51,-1,0))+1)","v":""},"SINAPI-87878",6260,4.3600000000000003,{"$f":"ROUND(IF(ISNUMBER(R51),R51,IF(LEFT(R51,3)=\"BDI\",HLOOKUP(R51,DADOS!$T$37:$X$38,2,FALSE),0)),15-11*$X$5)","v":0.26379999999999998}]
["S",0,1,5,0,0,2,0,0,"Serviço","1.5.2.","SINAPI","87777","EMBOÇO OU MASSA ÚNICA EM ARGAMASSA TRAÇO 1:2:8, PREPARO MANUAL, APLICADA MANUALMENTE EM PANOS DE FACHADA COM PRESENÇA DE VÃOS, ESPESSURA DE 25 MM. AF_08/2022",{"$f":"Referencia.Unidade","v":"M2"},{"$f":"OFFSET(PLQ!$E$12,ROW($P52)-ROW(P$12),0)","v":43.91},50.42,"BDI 1",63.72,2797.95,"",{"$f":"IF(OR($A52=0,$A52=\"S\",$A52>CFF!$A$9),\"\",MAX(V$12:OFFSET(V52,-1,0))+1)","v":""},"SINAPI-87777",6329,50.42,{"$f":"ROUND(IF(ISNUMBER(R52),R52,IF(LEFT(R52,3)=\"BDI\",HLOOKUP(R52,DADOS!$T$37:$X$38,2,FALSE),0)),15-11*$X$5)","v":0.26379999999999998}]
["S",0,1,5,0,0,3,0,0,"Serviço","1.5.3.","SINAPI","88485","APLICAÇÃO DE FUNDO SELADOR ACRÍLICO EM PAREDES, UMA DEMÃO. AF_06/2014",{"$f":"Referencia.Unidade","v":"M2"},{"$f":"OFFSET(PLQ!$E$12,ROW($P53)-ROW(P$12),0)","v":43.91},2.61,"BDI 1",3.3,144.9,"",{"$f":"IF(OR($A53=0,$A53=\"S\",$A53>CFF!$A$9),\"\",MAX(V$12:OFFSET(V53,-1,0))+1)","v":""},"SINAPI-88485",5993,2.61,{"$f":"ROUND(IF(ISNUMBER(R53),R53,IF(LEFT(R53,3)=\"BDI\",HLOOKUP(R53,DADOS!$T$37:$X$38,2,FALSE),0)),15-11*$X$5)","v":0.26379999999999998}]
["S",0,1,5,0,0,4,0,0,"Serviço","1.5.4.","SINAPI","88489","APLICAÇÃO MANUAL DE PINTURA COM TINTA LÁTEX ACRÍLICA EM PAREDES, DUAS DEMÃOS. AF_06/2014",{"$f":"Referencia.Unidade","v":"M2"},{"$f":"OFFSET(PLQ!$E$12,ROW($P54)-ROW(P$12),0)","v":43.91},15.69,"BDI 1",19.829999999999998,870.74,"",{"$f":"IF(OR($A54=0,$A54=\"S\",$A54>CFF!$A$9),\"\",MAX(V$12:OFFSET(V54,-1,0))+1)","v":""},"SINAPI-88489",5995,15.69,{"$f":"ROUND(IF(ISNUMBER(R54),R54,IF(LEFT(R54,3)=\"BDI\",HLOOKUP(R54,DADOS!$T$37:$X$38,2,FALSE),0)),15-11*$X$5)","v":0.26379999999999998}]
["S",0,1,5,0,0,5,0,0,"Serviço","1.5.5.","SINAPI","87528","EMBOÇO, PARA RECEBIMENTO DE CERÂMICA, EM ARGAMASSA TRAÇO 1:2:8, PREPARO MANUAL, APLICADO MANUALMENTE EM FACES INTERNAS DE PAREDES, PARA AMBIENTE COM ÁREA MENOR QUE 5M2, ESPESSURA DE 20MM, COM EXECUÇÃO DE TALISCAS. AF_06/2014",{"$f":"Referencia.Unidade","v":"M2"},{"$f":"OFFSET(PLQ!$E$12,ROW($P55)-ROW(P$12),0)","v":20.41},39.9,"BDI 1",50.43,1029.28,"",{"$f":"IF(OR($A55=0,$A55=\"S\",$A55>CFF!$A$9),\"\",MAX(V$12:OFFSET(V55,-1,0))+1)","v":""},"SINAPI-87528",6303,39.9,{"$f":"ROUND(IF(ISNUMBER(R55),R55,IF(LEFT(R55,3)=\"BDI\",HLOOKUP(R55,DADOS!$T$37:$X$38,2,FALSE),0)),15-11*$X$5)","v":0.26379999999999998}]
["S",0,1,5,0,0,6,0,0,"Serviço","1.5.6.","SINAPI","104611","REVESTIMENTO CERÂMICO PARA PAREDES INTERNAS COM PLACAS TIPO ESMALTADA EXTRA DE DIMENSÕES 60X60 CM APLICADAS NA ALTURA INTEIRA DAS PAREDES. AF_02/2023_PE",{"$f":"Referencia.Unidade","v":"M2"},{"$f":"OFFSET(PLQ!$E$12,ROW($P56)-ROW(P$12),0)","v":20.41},73.42,"BDI 1",92.79,1893.84,"",{"$f":"IF(OR($A56=0,$A56=\"S\",$A56>CFF!$A$9),\"\",MAX(V$12:OFFSET(V56,-1,0))+1)","v":""},"SINAPI-104611",6491,73.42,{"$f":"ROUND(IF(ISNUMBER(R56),R56,IF(LEFT(R56,3)=\"BDI\",HLOOKUP(R56,DADOS!$T$37:$X$38,2,FALSE),0)),15-11*$X$5)","v":0.26379999999999998}]
["S",0,1,5,0,0,7,0,0,"Serviço","1.5.7.","SINAPI","102213","PINTURA VERNIZ (INCOLOR) ALQUÍDICO EM MADEIRA, USO INTERNO E EXTERNO, 2 DEMÃOS. AF_01/2021",{"$f":"Referencia.Unidade","v":"M2"},{"$f":"OFFSET(PLQ!$E$12,ROW($P57)-ROW(P$12),0)","v":103.92},18.57,"BDI 1",23.47,2439,"",{"$f":"IF(OR($A57=0,$A57=\"S\",$A57>CFF!$A$9),\"\",MAX(V$12:OFFSET(V57,-1,0))+1)","v":""},"SINAPI-102213",6030,18.57,{"$f":"ROUND(IF(ISNUMBER(R57),R57,IF(LEFT(R57,3)=\"BDI\",HLOOKUP(R57,DADOS!$T$37:$X$38,2,FALSE),0)),15-11*$X$5)","v":0.26379999999999998}]
[{"$f":"CHOOSE(1+LOG(1+2*(J58=\"Meta\")+4*(J58=\"Nível 2\")+8*(J58=\"Nível 3\")+16*(J58=\"Nível 4\")+32*(J58=\"Serviço\"),2),0,1,2,3,4,\"S\")","v":"S"},{"$f":"IF(OR(A58=\"S\",A58=0),0,IF(ISERROR(I58),H58,SMALL(H58:I58,1)))","v":0},{"$f":"IF($A58=1,OFFSET(C58,-1,0)+1,OFFSET(C58,-1,0))","v":1},{"$f":"IF($A58=1,0,IF($A58=2,OFFSET(D58,-1,0)+1,OFFSET(D58,-1,0)))","v":5},{"$f":"IF(AND($A58<=2,$A58<>0),0,IF($A58=3,OFFSET(E58,-1,0)+1,OFFSET(E58,-1,0)))","v":0},{"$f":"IF(AND($A58<=3,$A58<>0),0,IF($A58=4,OFFSET(F58,-1,0)+1,OFFSET(F58,-1,0)))","v":0},{"$f":"IF(AND($A58<=4,$A58<>0),0,IF($A58=\"S\",OFFSET(G58,-1,0)+1,OFFSET(G58,-1,0)))","v":8},0,0,"Serviço",{"$f":"IF($A58=0,\"-\",CONCATENATE(C58&\".\",IF(AND($A$5>=2,$A58>=2),D58&\".\",\"\"),IF(AND($A$5>=3,$A58>=3),E58&\".\",\"\"),IF(AND($A$5>=4,$A58>=4),F58&\".\",\"\"),IF($A58=\"S\",G58&\".\",\"\")))","v":"1.5.8."},"SINAPI","102220",{"$f":"IF($A58=\"S\",Referencia.Descricao,\"(digite a descrição aqui)\")","v":"PINTURA TINTA DE ACABAMENTO (PIGMENTADA) ESMALTE SINTÉTICO BRILHANTE EM MADEIRA, 2 DEMÃOS. AF_01/2021"},{"$f":"Referencia.Unidade","v":"M2"},{"$f":"OFFSET(PLQ!$E$12,ROW($P58)-ROW(P$12),0)","v":6.6},14.35,"BDI 1",{"$f":"IF($A58=\"S\",IF($Q$10=\"Preço Unitário (R$)\",PO.CustoUnitario,ROUND(PO.CustoUnitario*(1+$Z58),15-13*$X$6)),0)","v":18.14},{"$f":"IF($A58=\"S\",VTOTAL1,IF($A58=0,0,ROUND(SomaAgrup,15-13*$X$7)))","v":119.72},{"$f":"IF($J58=\"\",\"\",IF($N58=\"\",\"DESCRIÇÃO\",IF(AND($J58=\"Serviço\",$O58=\"\"),\"UNIDADE\",IF($T58<=0,\"SEM VALOR\",IF(AND($Y58<>\"\",$Q58>$Y58),\"ACIMA REF.\",\"\")))))","v":""},{"$f":"IF(OR($A58=0,$A58=\"S\",$A58>CFF!$A$9),\"\",MAX(V$12:OFFSET(V58,-1,0))+1)","v":""},{"$f":"IF(AND($J58=\"Serviço\",$M58<>\"\"),IF($L58=\"\",$M58,CONCATENATE($L58,\"-\",$M58)))","v":"SINAPI-102220"},{"$f":"IF(AND(Fonte<>\"\",Código<>\"\"),MATCH(Fonte&\" \"&IF(Fonte=\"sinapi\",SUBSTITUTE(SUBSTITUTE(Código,\"/00\",\"/\"),\"/0\",\"/\"),Código),INDIRECT(\"'[Referência \"&_xlnm.Database&\".xls]Banco'!$a:$a\"),0),\"X\")","v":6036},{"$f":"IF(Import.Desoneracao=\"sim\",Referencia.Desonerado,Referencia.NaoDesonerado)","v":14.35},{"$f":"ROUND(IF(ISNUMBER(R58),R58,IF(LEFT(R58,3)=\"BDI\",HLOOKUP(R58,DADOS!$T$37:$X$38,2,FALSE),0)),15-11*$X$5)","v":0.26379999999999998}]
[2,6,1,6,0,0,0,83,6,"Nível 2","1.6.",null,null,"PAVIMENTAÇÃO INTERNA",{"$f":"Referencia.Unidade","v":""},{"$f":"OFFSET(PLQ!$E$12,ROW($P59)-ROW(P$12),0)","v":0},null,"BDI 1",0,6208.84,"",{"$f":"IF(OR($A59=0,$A59=\"S\",$A59>CFF!$A$9),\"\",MAX(V$12:OFFSET(V59,-1,0))+1)","v":7},false,"X",0,{"$f":"ROUND(IF(ISNUMBER(R59),R59,IF(LEFT(R59,3)=\"BDI\",HLOOKUP(R59,DADOS!$T$37:$X$38,2,FALSE),0)),15-11*$X$5)","v":0.26379999999999998}]
["S",0,1,6,0,0,1,0,0,"Serviço","1.6.1.","SINAPI","100324","LASTRO COM MATERIAL GRANULAR (PEDRA BRITADA N.1 E PEDRA BRITADA N.2), APLICADO EM PISOS OU LAJES SOBRE SOLO, ESPESSURA DE *10 CM*. AF_07/2019",{"$f":"Referencia.Unidade","v":"M3"},{"$f":"OFFSET(PLQ!$E$12,ROW($P60)-ROW(P$12),0)","v":2.3199999999999998},112.26,"BDI 1",141.87,329.14,"",{"$f":"IF(OR($A60=0,$A60=\"S\",$A60>CFF!$A$9),\"\",MAX(V$12:OFFSET(V60,-1,0))+1)","v":""},"SINAPI-100324",2213,112.26,{"$f":"ROUND(IF(ISNUMBER(R60),R60,IF(LEFT(R60,3)=\"BDI\",HLOOKUP(R60,DADOS!$T$37:$X$38,2,FALSE),0)),15-11*$X$5)","v":0.26379999999999998}]
["S",0,1,6,0,0,2,0,0,"Serviço","1.6.2.","SINAPI","95241","LASTRO DE CONCRETO MAGRO, APLICADO EM PISOS, LAJES SOBRE SOLO OU RADIERS, ESPESSURA DE 5 CM. AF_07/2016",{"$f":"Referencia.Unidade","v":"M2"},{"$f":"OFFSET(PLQ!$E$12,ROW($P61)-ROW(P$12),0)","v":46.36},27.91,"BDI 1",35.270000000000003,1635.12,"",{"$f":"IF(OR($A61=0,$A61=\"S\",$A61>CFF!$A$9),\"\",MAX(V$12:OFFSET(V61,-1,0))+1)","v":""},"SINAPI-95241",2186,27.91,{"$f":"ROUND(IF(ISNUMBER(R61),R61,IF(LEFT(R61,3)=\"BDI\",HLOOKUP(R61,DADOS!$T$37:$X$38,2,FALSE),0)),15-11*$X$5)","v":0.26379999999999998}]
["S",0,1,6,0,0,3,0,0,"Serviço","1.6.3.","SINAPI","87251","REVESTIMENTO CERÂMICO PARA PISO COM PLACAS TIPO ESMALTADA EXTRA DE DIMENSÕES 45X45 CM APLICADA EM AMBIENTES DE ÁREA MAIOR QUE 10 M2. AF_02/2023_PE",{"$f":"Referencia.Unidade","v":"M2"},{"$f":"OFFSET(PLQ!$E$12,ROW($P62)-ROW(P$12),0)","v":48.68},46.08,"BDI 1",58.24,2835.12,"",{"$f":"IF(OR($A62=0,$A62=\"S\",$A62>CFF!$A$9),\"\",MAX(V$12:OFFSET(V62,-1,0))+1)","v":""},"SINAPI-87251",6117,46.08,{"$f":"ROUND(IF(ISNUMBER(R62),R62,IF(LEFT(R62,3)=\"BDI\",HLOOKUP(R62,DADOS!$T$37:$X$38,2,FALSE),0)),15-11*$X$5)","v":0.26379999999999998}]
["S",0,1,6,0,0,4,0,0,"Serviço","1.6.4.","SINAPI","101739","RODAPÉ EM MADEIRA, ALTURA 7CM, FIXADO COM COLA E PARAFUSOS. AF_09/2020",{"$f":"Referencia.Unidade","v":"M"},{"$f":"OFFSET(PLQ!$E$12,ROW($P63)-ROW(P$12),0)","v":35.21},30.76,"BDI 1",38.869999999999997,1368.61,"",{"$f":"IF(OR($A63=0,$A63=\"S\",$A63>CFF!$A$9),\"\",MAX(V$12:OFFSET(V63,-1,0))+1)","v":""},"SINAPI-101739",6181,30.76,{"$f":"ROUND(IF(ISNUMBER(R63),R63,IF(LEFT(R63,3)=\"BDI\",HLOOKUP(R63,DADOS!$T$37:$X$38,2,FALSE),0)),15-11*$X$5)","v":0.26379999999999998}]
["S",0,1,6,0,0,5,0,0,"Serviço","1.6.5.","SINAPI","88649","RODAPÉ CERÂMICO DE 7CM DE ALTURA COM PLACAS TIPO ESMALTADA EXTRA DE DIMENSÕES 45X45CM. AF_02/2023",{"$f":"Referencia.Unidade","v":"M"},{"$f":"OFFSET(PLQ!$E$12,ROW($P64)-ROW(P$12),0)","v":4.3499999999999996},7.43,"BDI 1",9.39,40.85,"",{"$f":"IF(OR($A64=0,$A64=\"S\",$A64>CFF!$A$9),\"\",MAX(V$12:OFFSET(V64,-1,0))+1)","v":""},"SINAPI-88649",6183,7.43,{"$f":"ROUND(IF(ISNUMBER(R64),R64,IF(LEFT(R64,3)=\"BDI\",HLOOKUP(R64,DADOS!$T$37:$X$38,2,FALSE),0)),15-11*$X$5)","v":0.26379999999999998}]
[2,6,1,7,0,0,0,77,6,"Nível 2","1.7.",null,null,"FORRO E COBERTURA",{"$f":"Referencia.Unidade","v":""},{"$f":"OFFSET(PLQ!$E$12,ROW($P65)-ROW(P$12),0)","v":0},null,"BDI 1",0,16457.439999999999,"",{"$f":"IF(OR($A65=0,$A65=\"S\",$A65>CFF!$A$9),\"\",MAX(V$12:OFFSET(V65,-1,0))+1)","v":8},false,"X",0,{"$f":"ROUND(IF(ISNUMBER(R65),R65,IF(LEFT(R65,3)=\"BDI\",HLOOKUP(R65,DADOS!$T$37:$X$38,2,FALSE),0)),15-11*$X$5)","v":0.26379999999999998}]
["S",0,1,7,0,0,1,0,0,"Serviço","1.7.1.","SINAPI","96111","FORRO EM RÉGUAS DE PVC, FRISADO, PARA AMBIENTES RESIDENCIAIS, INCLUSIVE ESTRUTURA DE FIXAÇÃO. AF_05/2017_PS",{"$f":"Referencia.Unidade","v":"M2"},{"$f":"OFFSET(PLQ!$E$12,ROW($P66)-ROW(P$12),0)","v":62.36},74.069999999999993,"BDI 1",93.61,5837.52,"",{"$f":"IF(OR($A66=0,$A66=\"S\",$A66>CFF!$A$9),\"\",MAX(V$12:OFFSET(V66,-1,0))+1)","v":""},"SINAPI-96111",6513,74.069999999999993,{"$f":"ROUND(IF(ISNUMBER(R66),R66,IF(LEFT(R66,3)=\"BDI\",HLOOKUP(R66,DADOS!$T$37:$X$38,2,FALSE),0)),15-11*$X$5)","v":0.26379999999999998}]
["S",0,1,7,0,0,2,0,0,"Serviço","1.7.2.","SINAPI","96121","ACABAMENTOS PARA FORRO (RODA-FORRO EM PERFIL METÁLICO E PLÁSTICO). AF_05/2017",{"$f":"Referencia.Unidade","v":"M"},{"$f":"OFFSET(PLQ!$E$12,ROW($P67)-ROW(P$12),0)","v":73.150000000000006},13.13,"BDI 1",16.59,1213.56,"",{"$f":"IF(OR($A67=0,$A67=\"S\",$A67>CFF!$A$9),\"\",MAX(V$12:OFFSET(V67,-1,0))+1)","v":""},"SINAPI-96121",6515,13.13,{"$f":"ROUND(IF(ISNUMBER(R67),R67,IF(LEFT(R67,3)=\"BDI\",HLOOKUP(R67,DADOS!$T$37:$X$38,2,FALSE),0)),15-11*$X$5)","v":0.26379999999999998}]
["S",0,1,7,0,0,3,0,0,"Serviço","1.7.3.","SINAPI","92259","INSTALAÇÃO DE TESOURA (INTEIRA OU MEIA), BIAPOIADA, EM MADEIRA NÃO APARELHADA, PARA VÃOS MAIORES OU IGUAIS A 3,0 M E MENORES QUE 6,0 M, INCLUSO IÇAMENTO. AF_07/2019",{"$f":"Referencia.Unidade","v":"UN"},{"$f":"OFFSET(PLQ!$E$12,ROW($P68)-ROW(P$12),0)","v":9},340.11,"BDI 1",429.83,3868.47,"",{"$f":"IF(OR($A68=0,$A68=\"S\",$A68>CFF!$A$9),\"\",MAX(V$12:OFFSET(V68,-1,0))+1)","v":""},"SINAPI-92259",1319,340.11,{"$f":"ROUND(IF(ISNUMBER(R68),R68,IF(LEFT(R68,3)=\"BDI\",HLOOKUP(R68,DADOS!$T$37:$X$38,2,FALSE),0)),15-11*$X$5)","v":0.26379999999999998}]
[{"$f":"CHOOSE(1+LOG(1+2*(J69=\"Meta\")+4*(J69=\"Nível 2\")+8*(J69=\"Nível 3\")+16*(J69=\"Nível 4\")+32*(J69=\"Serviço\"),2),0,1,2,3,4,\"S\")","v":"S"},{"$f":"IF(OR(A69=\"S\",A69=0),0,IF(ISERROR(I69),H69,SMALL(H69:I69,1)))","v":0},{"$f":"IF($A69=1,OFFSET(C69,-1,0)+1,OFFSET(C69,-1,0))","v":1},{"$f":"IF($A69=1,0,IF($A69=2,OFFSET(D69,-1,0)+1,OFFSET(D69,-1,0)))","v":7},{"$f":"IF(AND($A69<=2,$A69<>0),0,IF($A69=3,OFFSET(E69,-1,0)+1,OFFSET(E69,-1,0)))","v":0},{"$f":"IF(AND($A69<=3,$A69<>0),0,IF($A69=4,OFFSET(F69,-1,0)+1,OFFSET(F69,-1,0)))","v":0},{"$f":"IF(AND($A69<=4,$A69<>0),0,IF($A69=\"S\",OFFSET(G69,-1,0)+1,OFFSET(G69,-1,0)))","v":4},0,0,"Serviço",{"$f":"IF($A69=0,\"-\",CONCATENATE(C69&\".\",IF(AND($A$5>=2,$A69>=2),D69&\".\",\"\"),IF(AND($A$5>=3,$A69>=3),E69&\".\",\"\"),IF(AND($A$5>=4,$A69>=4),F69&\".\",\"\"),IF($A69=\"S\",G69&\".\",\"\")))","v":"1.7.4."},"SINAPI","94207","TELHAMENTO COM TELHA ONDULADA DE FIBROCIMENTO E = 6 MM, COM RECOBRIMENTO LATERAL DE 1/4 DE ONDA PARA TELHADO COM INCLINAÇÃO MAIOR QUE 10°, COM ATÉ 2 ÁGUAS, INCLUSO IÇAMENTO. AF_07/2019",{"$f":"Referencia.Unidade","v":"M2"},{"$f":"OFFSET(PLQ!$E$12,ROW($P69)-ROW(P$12),0)","v":73.739999999999995},47.88,"BDI 1",{"$f":"IF($A69=\"S\",IF($Q$10=\"Preço Unitário (R$)\",PO.CustoUnitario,ROUND(PO.CustoUnitario*(1+$Z69),15-13*$X$6)),0)","v":60.51},{"$f":"IF($A69=\"S\",VTOTAL1,IF($A69=0,0,ROUND(SomaAgrup,15-13*$X$7)))","v":4462.01},{"$f":"IF($J69=\"\",\"\",IF($N69=\"\",\"DESCRIÇÃO\",IF(AND($J69=\"Serviço\",$O69=\"\"),\"UNIDADE\",IF($T69<=0,\"SEM VALOR\",IF(AND($Y69<>\"\",$Q69>$Y69),\"ACIMA REF.\",\"\")))))","v":""},{"$f":"IF(OR($A69=0,$A69=\"S\",$A69>CFF!$A$9),\"\",MAX(V$12:OFFSET(V69,-1,0))+1)","v":""},{"$f":"IF(AND($J69=\"Serviço\",$M69<>\"\"),IF($L69=\"\",$M69,CONCATENATE($L69,\"-\",$M69)))","v":"SINAPI-94207"},{"$f":"IF(AND(Fonte<>\"\",Código<>\"\"),MATCH(Fonte&\" \"&IF(Fonte=\"sinapi\",SUBSTITUTE(SUBSTITUTE(Código,\"/00\",\"/\"),\"/0\",\"/\"),Código),INDIRECT(\"'[Referência \"&_xlnm.Database&\".xls]Banco'!$a:$a\"),0),\"X\")","v":1385},{"$f":"IF(Import.Desoneracao=\"sim\",Referencia.Desonerado,Referencia.NaoDesonerado)","v":47.88},{"$f":"ROUND(IF(ISNUMBER(R69),R69,IF(LEFT(R69,3)=\"BDI\",HLOOKUP(R69,DADOS!$T$37:$X$38,2,FALSE),0)),15-11*$X$5)","v":0.26379999999999998}]
["S",0,1,7,0,0,5,0,0,"Serviço","1.7.5.","SINAPI","100325","CUMEEIRA SHED PARA TELHA ONDULADA DE FIBROCIMENTO, E = 6 MM, INCLUSO ACESSÓRIOS DE FIXAÇÃO E IÇAMENTO. AF_07/2019",{"$f":"Referencia.Unidade","v":"M"},{"$f":"OFFSET(PLQ!$E$12,ROW($P70)-ROW(P$12),0)","v":9.5},89.61,"BDI 1",113.25,1075.8800000000001,"",{"$f":"IF(OR($A70=0,$A70=\"S\",$A70>CFF!$A$9),\"\",MAX(V$12:OFFSET(V70,-1,0))+1)","v":""},"SINAPI-100325",1396,{"$f":"IF(Import.Desoneracao=\"sim\",Referencia.Desonerado,Referencia.NaoDesonerado)","v":89.61},{"$f":"ROUND(IF(ISNUMBER(R70),R70,IF(LEFT(R70,3)=\"BDI\",HLOOKUP(R70,DADOS!$T$37:$X$38,2,FALSE),0)),15-11*$X$5)","v":0.26379999999999998}]
[2,24,1,8,0,0,0,71,24,"Nível 2","1.8.",null,null,"ISTALAÇÕES ELÉTRICA",{"$f":"Referencia.Unidade","v":""},{"$f":"OFFSET(PLQ!$E$12,ROW($P71)-ROW(P$12),0)","v":0},null,"BDI 1",0,5051.21,"",{"$f":"IF(OR($A71=0,$A71=\"S\",$A71>CFF!$A$9),\"\",MAX(V$12:OFFSET(V71,-1,0))+1)","v":9},false,"X",{"$f":"IF(Import.Desoneracao=\"sim\",Referencia.Desonerado,Referencia.NaoDesonerado)","v":0},{"$f":"ROUND(IF(ISNUMBER(R71),R71,IF(LEFT(R71,3)=\"BDI\",HLOOKUP(R71,DADOS!$T$37:$X$38,2,FALSE),0)),15-11*$X$5)","v":0.26379999999999998}]
["S",0,1,8,0,0,1,0,0,"Serviço","1.8.1.","SINAPI","91940",{"$f":"IF($A72=\"S\",Referencia.Descricao,\"(digite a descrição aqui)\")","v":"CAIXA RETANGULAR 4\" X 2\" MÉDIA (1,30 M DO PISO), PVC, INSTALADA EM PAREDE - FORNECIMENTO E INSTALAÇÃO. AF_03/2023"},{"$f":"Referencia.Unidade","v":"UN"},{"$f":"OFFSET(PLQ!$E$12,ROW($P72)-ROW(P$12),0)","v":18},16.829999999999998,"BDI 1",21.27,382.86,"",{"$f":"IF(OR($A72=0,$A72=\"S\",$A72>CFF!$A$9),\"\",MAX(V$12:OFFSET(V72,-1,0))+1)","v":""},"SINAPI-91940",2880,{"$f":"IF(Import.Desoneracao=\"sim\",Referencia.Desonerado,Referencia.NaoDesonerado)","v":16.829999999999998},{"$f":"ROUND(IF(ISNUMBER(R72),R72,IF(LEFT(R72,3)=\"BDI\",HLOOKUP(R72,DADOS!$T$37:$X$38,2,FALSE),0)),15-11*$X$5)","v":0.26379999999999998}]
["S",0,1,8,0,0,2,0,0,"Serviço","1.8.2.","SINAPI","91943",{"$f":"IF($A73=\"S\",Referencia.Descricao,\"(digite a descrição aqui)\")","v":"CAIXA RETANGULAR 4\" X 4\" MÉDIA (1,30 M DO PISO), PVC, INSTALADA EM PAREDE - FORNECIMENTO E INSTALAÇÃO. AF_03/2023"},{"$f":"Referencia.Unidade","v":"UN"},{"$f":"OFFSET(PLQ!$E$12,ROW($P73)-ROW(P$12),0)","v":1},20.34,"BDI 1",25.71,25.71,"",{"$f":"IF(OR($A73=0,$A73=\"S\",$A73>CFF!$A$9),\"\",MAX(V$12:OFFSET(V73,-1,0))+1)","v":""},"SINAPI-91943",2883,{"$f":"IF(Import.Desoneracao=\"sim\",Referencia.Desonerado,Referencia.NaoDesonerado)","v":20.34},{"$f":"ROUND(IF(ISNUMBER(R73),R73,IF(LEFT(R73,3)=\"BDI\",HLOOKUP(R73,DADOS!$T$37:$X$38,2,FALSE),0)),15-11*$X$5)","v":0.26379999999999998}]
["S",0,1,8,0,0,3,0,0,"Serviço","1.8.3.","SINAPI","91937",{"$f":"IF($A74=\"S\",Referencia.Descricao,\"(digite a descrição aqui)\")","v":"CAIXA OCTOGONAL 3\" X 3\", PVC, INSTALADA EM LAJE - FORNECIMENTO E INSTALAÇÃO. AF_03/2023"},{"$f":"Referencia.Unidade","v":"UN"},{"$f":"OFFSET(PLQ!$E$12,ROW($P74)-ROW(P$12),0)","v":9},15.38,"BDI 1",19.440000000000001,174.96,"",{"$f":"IF(OR($A74=0,$A74=\"S\",$A74>CFF!$A$9),\"\",MAX(V$12:OFFSET(V74,-1,0))+1)","v":""},"SINAPI-91937",2878,{"$f":"IF(Import.Desoneracao=\"sim\",Referencia.Desonerado,Referencia.NaoDesonerado)","v":15.38},{"$f":"ROUND(IF(ISNUMBER(R74),R74,IF(LEFT(R74,3)=\"BDI\",HLOOKUP(R74,DADOS!$T$37:$X$38,2,FALSE),0)),15-11*$X$5)","v":0.26379999999999998}]
["S",0,1,8,0,0,4,0,0,"Serviço","1.8.4.","SINAPI","91924",{"$f":"IF($A75=\"S\",Referencia.Descricao,\"(digite a descrição aqui)\")","v":"CABO DE COBRE FLEXÍVEL ISOLADO, 1,5 MM², ANTI-CHAMA 450/750 V, PARA CIRCUITOS TERMINAIS - FORNECIMENTO E INSTALAÇÃO. AF_03/2023"},{"$f":"Referencia.Unidade","v":"M"},{"$f":"OFFSET(PLQ!$E$12,ROW($P75)-ROW(P$12),0)","v":85.3},2.63,"BDI 1",3.32,283.2,"",{"$f":"IF(OR($A75=0,$A75=\"S\",$A75>CFF!$A$9),\"\",MAX(V$12:OFFSET(V75,-1,0))+1)","v":""},"SINAPI-91924",2845,{"$f":"IF(Import.Desoneracao=\"sim\",Referencia.Desonerado,Referencia.NaoDesonerado)","v":2.63},{"$f":"ROUND(IF(ISNUMBER(R75),R75,IF(LEFT(R75,3)=\"BDI\",HLOOKUP(R75,DADOS!$T$37:$X$38,2,FALSE),0)),15-11*$X$5)","v":0.26379999999999998}]
["S",0,1,8,0,0,5,0,0,"Serviço","1.8.5.","SINAPI","91926",{"$f":"IF($A76=\"S\",Referencia.Descricao,\"(digite a descrição aqui)\")","v":"CABO DE COBRE FLEXÍVEL ISOLADO, 2,5 MM², ANTI-CHAMA 450/750 V, PARA CIRCUITOS TERMINAIS - FORNECIMENTO E INSTALAÇÃO. AF_03/2023"},{"$f":"Referencia.Unidade","v":"M"},{"$f":"OFFSET(PLQ!$E$12,ROW($P76)-ROW(P$12),0)","v":182},3.82,"BDI 1",4.83,879.06,"",{"$f":"IF(OR($A76=0,$A76=\"S\",$A76>CFF!$A$9),\"\",MAX(V$12:OFFSET(V76,-1,0))+1)","v":""},"SINAPI-91926",2847,{"$f":"IF(Import.Desoneracao=\"sim\",Referencia.Desonerado,Referencia.NaoDesonerado)","v":3.82},{"$f":"ROUND(IF(ISNUMBER(R76),R76,IF(LEFT(R76,3)=\"BDI\",HLOOKUP(R76,DADOS!$T$37:$X$38,2,FALSE),0)),15-11*$X$5)","v":0.26379999999999998}]
["S",0,1,8,0,0,6,{"$f":"IF(OR($A77=\"S\",$A77=0),0,MATCH(0,OFFSET($B77,1,$A77,ROW($A$142)-ROW($A77)),0))","v":0},{"$f":"IF(OR($A77=\"S\",$A77=0),0,MATCH(OFFSET($B77,0,$A77)+1,OFFSET($B77,1,$A77,ROW($A$142)-ROW($A77)),0))","v":0},"Serviço","1.8.6.","SINAPI","91928",{"$f":"IF($A77=\"S\",Referencia.Descricao,\"(digite a descrição aqui)\")","v":"CABO DE COBRE FLEXÍVEL ISOLADO, 4 MM², ANTI-CHAMA 450/750 V, PARA CIRCUITOS TERMINAIS - FORNECIMENTO E INSTALAÇÃO. AF_03/2023"},{"$f":"Referencia.Unidade","v":"M"},{"$f":"OFFSET(PLQ!$E$12,ROW($P77)-ROW(P$12),0)","v":14},5.93,"BDI 1",7.49,104.86,"",{"$f":"IF(OR($A77=0,$A77=\"S\",$A77>CFF!$A$9),\"\",MAX(V$12:OFFSET(V77,-1,0))+1)","v":""},"SINAPI-91928",2849,{"$f":"IF(Import.Desoneracao=\"sim\",Referencia.Desonerado,Referencia.NaoDesonerado)","v":5.93},{"$f":"ROUND(IF(ISNUMBER(R77),R77,IF(LEFT(R77,3)=\"BDI\",HLOOKUP(R77,DADOS!$T$37:$X$38,2,FALSE),0)),15-11*$X$5)","v":0.26379999999999998}]
["S",0,1,8,0,0,7,0,0,"Serviço","1.8.7.","SINAPI","91930",{"$f":"IF($A78=\"S\",Referencia.Descricao,\"(digite a descrição aqui)\")","v":"CABO DE COBRE FLEXÍVEL ISOLADO, 6 MM², ANTI-CHAMA 450/750 V, PARA CIRCUITOS TERMINAIS - FORNECIMENTO E INSTALAÇÃO. AF_03/2023"},{"$f":"Referencia.Unidade","v":"M"},{"$f":"OFFSET(PLQ!$E$12,ROW($P78)-ROW(P$12),0)","v":10},8.2799999999999994,"BDI 1",10.46,104.6,"",{"$f":"IF(OR($A78=0,$A78=\"S\",$A78>CFF!$A$9),\"\",MAX(V$12:OFFSET(V78,-1,0))+1)","v":""},"SINAPI-91930",2851,{"$f":"IF(Import.Desoneracao=\"sim\",Referencia.Desonerado,Referencia.NaoDesonerado)","v":8.2799999999999994},{"$f":"ROUND(IF(ISNUMBER(R78),R78,IF(LEFT(R78,3)=\"BDI\",HLOOKUP(R78,DADOS!$T$37:$X$38,2,FALSE),0)),15-11*$X$5)","v":0.26379999999999998}]
["S",0,1,8,0,0,8,0,0,"Serviço","1.8.8.","SINAPI","91932",{"$f":"IF($A79=\"S\",Referencia.Descricao,\"(digite a descrição aqui)\")","v":"CABO DE COBRE FLEXÍVEL ISOLADO, 10 MM², ANTI-CHAMA 450/750 V, PARA CIRCUITOS TERMINAIS - FORNECIMENTO E INSTALAÇÃO. AF_03/2023"},{"$f":"Referencia.Unidade","v":"M"},{"$f":"OFFSET(PLQ!$E$12,ROW($P79)-ROW(P$12),0)","v":22},14.83,"BDI 1",18.739999999999998,412.28,"",{"$f":"IF(OR($A79=0,$A79=\"S\",$A79>CFF!$A$9),\"\",MAX(V$12:OFFSET(V79,-1,0))+1)","v":""},"SINAPI-91932",2853,{"$f":"IF(Import.Desoneracao=\"sim\",Referencia.Desonerado,Referencia.NaoDesonerado)","v":14.83},{"$f":"ROUND(IF(ISNUMBER(R79),R79,IF(LEFT(R79,3)=\"BDI\",HLOOKUP(R79,DADOS!$T$37:$X$38,2,FALSE),0)),15-11*$X$5)","v":0.26379999999999998}]
["S",0,1,8,0,0,9,0,0,"Serviço","1.8.9.","SINAPI","92023",{"$f":"IF($A80=\"S\",Referencia.Descricao,\"(digite a descrição aqui)\")","v":"INTERRUPTOR SIMPLES (1 MÓDULO) COM 1 TOMADA DE EMBUTIR 2P+T 10 A, INCLUINDO SUPORTE E PLACA - FORNECIMENTO E INSTALAÇÃO. AF_03/2023"},{"$f":"Referencia.Unidade","v":"UN"},{"$f":"OFFSET(PLQ!$E$12,ROW($P80)-ROW(P$12),0)","v":3},49.39,"BDI 1",62.42,187.26,"",{"$f":"IF(OR($A80=0,$A80=\"S\",$A80>CFF!$A$9),\"\",MAX(V$12:OFFSET(V80,-1,0))+1)","v":""},"SINAPI-92023",3076,{"$f":"IF(Import.Desoneracao=\"sim\",Referencia.Desonerado,Referencia.NaoDesonerado)","v":49.49},{"$f":"ROUND(IF(ISNUMBER(R80),R80,IF(LEFT(R80,3)=\"BDI\",HLOOKUP(R80,DADOS!$T$37:$X$38,2,FALSE),0)),15-11*$X$5)","v":0.26379999999999998}]
["S",0,1,8,0,0,10,0,0,"Serviço","1.8.10.","SINAPI","91959",{"$f":"IF($A81=\"S\",Referencia.Descricao,\"(digite a descrição aqui)\")","v":"INTERRUPTOR SIMPLES (2 MÓDULOS), 10A/250V, INCLUINDO SUPORTE E PLACA - FORNECIMENTO E INSTALAÇÃO. AF_03/2023"},{"$f":"Referencia.Unidade","v":"UN"},{"$f":"OFFSET(PLQ!$E$12,ROW($P81)-ROW(P$12),0)","v":3},44.58,"BDI 1",56.34,169.02,"",{"$f":"IF(OR($A81=0,$A81=\"S\",$A81>CFF!$A$9),\"\",MAX(V$12:OFFSET(V81,-1,0))+1)","v":""},"SINAPI-91959",3012,{"$f":"IF(Import.Desoneracao=\"sim\",Referencia.Desonerado,Referencia.NaoDesonerado)","v":44.58},{"$f":"ROUND(IF(ISNUMBER(R81),R81,IF(LEFT(R81,3)=\"BDI\",HLOOKUP(R81,DADOS!$T$37:$X$38,2,FALSE),0)),15-11*$X$5)","v":0.26379999999999998}]
["S",0,1,8,0,0,11,0,0,"Serviço","1.8.11.","SINAPI","91996",{"$f":"IF($A82=\"S\",Referencia.Descricao,\"(digite a descrição aqui)\")","v":"TOMADA MÉDIA DE EMBUTIR (1 MÓDULO), 2P+T 10 A, INCLUINDO SUPORTE E PLACA - FORNECIMENTO E INSTALAÇÃO. AF_03/2023"},{"$f":"Referencia.Unidade","v":"UN"},{"$f":"OFFSET(PLQ!$E$12,ROW($P82)-ROW(P$12),0)","v":12},34.06,"BDI 1",43.05,516.6,"",{"$f":"IF(OR($A82=0,$A82=\"S\",$A82>CFF!$A$9),\"\",MAX(V$12:OFFSET(V82,-1,0))+1)","v":""},"SINAPI-91996",3049,{"$f":"IF(Import.Desoneracao=\"sim\",Referencia.Desonerado,Referencia.NaoDesonerado)","v":34.06},{"$f":"ROUND(IF(ISNUMBER(R82),R82,IF(LEFT(R82,3)=\"BDI\",HLOOKUP(R82,DADOS!$T$37:$X$38,2,FALSE),0)),15-11*$X$5)","v":0.26379999999999998}]
["S",0,1,8,0,0,12,0,0,"Serviço","1.8.12.","SINAPI","92004",{"$f":"IF($A83=\"S\",Referencia.Descricao,\"(digite a descrição aqui)\")","v":"TOMADA MÉDIA DE EMBUTIR (2 MÓDULOS), 2P+T 10 A, INCLUINDO SUPORTE E PLACA - FORNECIMENTO E INSTALAÇÃO. AF_03/2023"},{"$f":"Referencia.Unidade","v":"UN"},{"$f":"OFFSET(PLQ!$E$12,ROW($P83)-ROW(P$12),0)","v":1},54.5,"BDI 1",68.88,68.88,"",{"$f":"IF(OR($A83=0,$A83=\"S\",$A83>CFF!$A$9),\"\",MAX(V$12:OFFSET(V83,-1,0))+1)","v":""},"SINAPI-92004",3057,{"$f":"IF(Import.Desoneracao=\"sim\",Referencia.Desonerado,Referencia.NaoDesonerado)","v":54.5},{"$f":"ROUND(IF(ISNUMBER(R83),R83,IF(LEFT(R83,3)=\"BDI\",HLOOKUP(R83,DADOS!$T$37:$X$38,2,FALSE),0)),15-11*$X$5)","v":0.26379999999999998}]
["S",0,1,8,0,0,13,0,0,"Serviço","1.8.13.","SINAPI-I","38091",{"$f":"IF($A84=\"S\",Referencia.Descricao,\"(digite a descrição aqui)\")","v":"ESPELHO / PLACA CEGA 4\" X 2\", PARA INSTALACAO DE TOMADAS E INTERRUPTORES"},{"$f":"Referencia.Unidade","v":"UN    "},{"$f":"OFFSET(PLQ!$E$12,ROW($P84)-ROW(P$12),0)","v":1},2.7,"BDI 1",3.41,3.41,"",{"$f":"IF(OR($A84=0,$A84=\"S\",$A84>CFF!$A$9),\"\",MAX(V$12:OFFSET(V84,-1,0))+1)","v":""},"SINAPI-I-38091",9478,{"$f":"IF(Import.Desoneracao=\"sim\",Referencia.Desonerado,Referencia.NaoDesonerado)","v":2.7},{"$f":"ROUND(IF(ISNUMBER(R84),R84,IF(LEFT(R84,3)=\"BDI\",HLOOKUP(R84,DADOS!$T$37:$X$38,2,FALSE),0)),15-11*$X$5)","v":0.26379999999999998}]
["S",0,1,8,0,0,14,0,0,"Serviço","1.8.14.","SINAPI","93655",{"$f":"IF($A85=\"S\",Referencia.Descricao,\"(digite a descrição aqui)\")","v":"DISJUNTOR MONOPOLAR TIPO DIN, CORRENTE NOMINAL DE 20A - FORNECIMENTO E INSTALAÇÃO. AF_10/2020"},{"$f":"Referencia.Unidade","v":"UN"},{"$f":"OFFSET(PLQ!$E$12,ROW($P85)-ROW(P$12),0)","v":3},13.82,"BDI 1",17.47,52.41,"",{"$f":"IF(OR($A85=0,$A85=\"S\",$A85>CFF!$A$9),\"\",MAX(V$12:OFFSET(V85,-1,0))+1)","v":""},"SINAPI-93655",2950,{"$f":"IF(Import.Desoneracao=\"sim\",Referencia.Desonerado,Referencia.NaoDesonerado)","v":13.82},{"$f":"ROUND(IF(ISNUMBER(R85),R85,IF(LEFT(R85,3)=\"BDI\",HLOOKUP(R85,DADOS!$T$37:$X$38,2,FALSE),0)),15-11*$X$5)","v":0.26379999999999998}]
["S",0,1,8,0,0,15,0,0,"Serviço","1.8.15.","SINAPI","93657",{"$f":"IF($A86=\"S\",Referencia.Descricao,\"(digite a descrição aqui)\")","v":"DISJUNTOR MONOPOLAR TIPO DIN, CORRENTE NOMINAL DE 32A - FORNECIMENTO E INSTALAÇÃO. AF_10/2020"},{"$f":"Referencia.Unidade","v":"UN"},{"$f":"OFFSET(PLQ!$E$12,ROW($P86)-ROW(P$12),0)","v":1},15.26,"BDI 1",19.29,19.29,"",{"$f":"IF(OR($A86=0,$A86=\"S\",$A86>CFF!$A$9),\"\",MAX(V$12:OFFSET(V86,-1,0))+1)","v":""},"SINAPI-93657",2952,{"$f":"IF(Import.Desoneracao=\"sim\",Referencia.Desonerado,Referencia.NaoDesonerado)","v":15.26},{"$f":"ROUND(IF(ISNUMBER(R86),R86,IF(LEFT(R86,3)=\"BDI\",HLOOKUP(R86,DADOS!$T$37:$X$38,2,FALSE),0)),15-11*$X$5)","v":0.26379999999999998}]
["S",0,1,8,0,0,16,0,0,"Serviço","1.8.16.","SINAPI-I","39445",{"$f":"IF($A87=\"S\",Referencia.Descricao,\"(digite a descrição aqui)\")","v":"DISPOSITIVO DR, 2 POLOS, SENSIBILIDADE DE 30 MA, CORRENTE DE 25 A, TIPO AC"},{"$f":"Referencia.Unidade","v":"UN    "},{"$f":"OFFSET(PLQ!$E$12,ROW($P87)-ROW(P$12),0)","v":1},142.41999999999999,"BDI 1",179.99,179.99,"",{"$f":"IF(OR($A87=0,$A87=\"S\",$A87>CFF!$A$9),\"\",MAX(V$12:OFFSET(V87,-1,0))+1)","v":""},"SINAPI-I-39445",9260,{"$f":"IF(Import.Desoneracao=\"sim\",Referencia.Desonerado,Referencia.NaoDesonerado)","v":142.41999999999999},{"$f":"ROUND(IF(ISNUMBER(R87),R87,IF(LEFT(R87,3)=\"BDI\",HLOOKUP(R87,DADOS!$T$37:$X$38,2,FALSE),0)),15-11*$X$5)","v":0.26379999999999998}]
["S",0,1,8,0,0,17,0,0,"Serviço","1.8.17.","SINAPI-I","34628",{"$f":"IF($A88=\"S\",Referencia.Descricao,\"(digite a descrição aqui)\")","v":"DISJUNTOR TIPO DIN/IEC, BIPOLAR 63 A"},{"$f":"Referencia.Unidade","v":"UN    "},{"$f":"OFFSET(PLQ!$E$12,ROW($P88)-ROW(P$12),0)","v":1},74.78,"BDI 1",94.51,94.51,"",{"$f":"IF(OR($A88=0,$A88=\"S\",$A88>CFF!$A$9),\"\",MAX(V$12:OFFSET(V88,-1,0))+1)","v":""},"SINAPI-I-34628",9231,{"$f":"IF(Import.Desoneracao=\"sim\",Referencia.Desonerado,Referencia.NaoDesonerado)","v":74.78},{"$f":"ROUND(IF(ISNUMBER(R88),R88,IF(LEFT(R88,3)=\"BDI\",HLOOKUP(R88,DADOS!$T$37:$X$38,2,FALSE),0)),15-11*$X$5)","v":0.26379999999999998}]
["S",0,1,8,0,0,18,0,0,"Serviço","1.8.18.","SINAPI","91854",{"$f":"IF($A89=\"S\",Referencia.Descricao,\"(digite a descrição aqui)\")","v":"ELETRODUTO FLEXÍVEL CORRUGADO, PVC, DN 25 MM (3/4\"), PARA CIRCUITOS TERMINAIS, INSTALADO EM PAREDE - FORNECIMENTO E INSTALAÇÃO. AF_03/2023"},{"$f":"Referencia.Unidade","v":"M"},{"$f":"OFFSET(PLQ!$E$12,ROW($P89)-ROW(P$12),0)","v":76},9.4,"BDI 1",11.88,902.88,"",{"$f":"IF(OR($A89=0,$A89=\"S\",$A89>CFF!$A$9),\"\",MAX(V$12:OFFSET(V89,-1,0))+1)","v":""},"SINAPI-91854",2764,{"$f":"IF(Import.Desoneracao=\"sim\",Referencia.Desonerado,Referencia.NaoDesonerado)","v":9.4},{"$f":"ROUND(IF(ISNUMBER(R89),R89,IF(LEFT(R89,3)=\"BDI\",HLOOKUP(R89,DADOS!$T$37:$X$38,2,FALSE),0)),15-11*$X$5)","v":0.26379999999999998}]
["S",0,1,8,0,0,19,0,0,"Serviço","1.8.19.","SINAPI","91856",{"$f":"IF($A90=\"S\",Referencia.Descricao,\"(digite a descrição aqui)\")","v":"ELETRODUTO FLEXÍVEL CORRUGADO, PVC, DN 32 MM (1\"), PARA CIRCUITOS TERMINAIS, INSTALADO EM PAREDE - FORNECIMENTO E INSTALAÇÃO. AF_03/2023"},{"$f":"Referencia.Unidade","v":"M"},{"$f":"OFFSET(PLQ!$E$12,ROW($P90)-ROW(P$12),0)","v":10.199999999999999},12.41,"BDI 1",15.68,159.94,"",{"$f":"IF(OR($A90=0,$A90=\"S\",$A90>CFF!$A$9),\"\",MAX(V$12:OFFSET(V90,-1,0))+1)","v":""},"SINAPI-91856",2766,{"$f":"IF(Import.Desoneracao=\"sim\",Referencia.Desonerado,Referencia.NaoDesonerado)","v":12.41},{"$f":"ROUND(IF(ISNUMBER(R90),R90,IF(LEFT(R90,3)=\"BDI\",HLOOKUP(R90,DADOS!$T$37:$X$38,2,FALSE),0)),15-11*$X$5)","v":0.26379999999999998}]
["S",0,1,8,0,0,20,0,0,"Serviço","1.8.20.","SINAPI","97610",{"$f":"IF($A91=\"S\",Referencia.Descricao,\"(digite a descrição aqui)\")","v":"LÂMPADA COMPACTA DE LED 10 W, BASE E27 - FORNECIMENTO E INSTALAÇÃO. AF_02/2020"},{"$f":"Referencia.Unidade","v":"UN"},{"$f":"OFFSET(PLQ!$E$12,ROW($P91)-ROW(P$12),0)","v":9},16.61,"BDI 1",20.99,188.91,"",{"$f":"IF(OR($A91=0,$A91=\"S\",$A91>CFF!$A$9),\"\",MAX(V$12:OFFSET(V91,-1,0))+1)","v":""},"SINAPI-97610",3105,{"$f":"IF(Import.Desoneracao=\"sim\",Referencia.Desonerado,Referencia.NaoDesonerado)","v":16.61},{"$f":"ROUND(IF(ISNUMBER(R91),R91,IF(LEFT(R91,3)=\"BDI\",HLOOKUP(R91,DADOS!$T$37:$X$38,2,FALSE),0)),15-11*$X$5)","v":0.26379999999999998}]
["S",0,1,8,0,0,21,0,0,"Serviço","1.8.21.","SINAPI-I","38093",{"$f":"IF($A92=\"S\",Referencia.Descricao,\"(digite a descrição aqui)\")","v":"ESPELHO / PLACA DE 2 POSTOS 4\" X 2\", PARA INSTALACAO DE TOMADAS E INTERRUPTORES"},{"$f":"Referencia.Unidade","v":"UN    "},{"$f":"OFFSET(PLQ!$E$12,ROW($P92)-ROW(P$12),0)","v":7},2.65,"BDI 1",3.35,23.45,"",{"$f":"IF(OR($A92=0,$A92=\"S\",$A92>CFF!$A$9),\"\",MAX(V$12:OFFSET(V92,-1,0))+1)","v":""},"SINAPI-I-38093",9481,{"$f":"IF(Import.Desoneracao=\"sim\",Referencia.Desonerado,Referencia.NaoDesonerado)","v":2.65},{"$f":"ROUND(IF(ISNUMBER(R92),R92,IF(LEFT(R92,3)=\"BDI\",HLOOKUP(R92,DADOS!$T$37:$X$38,2,FALSE),0)),15-11*$X$5)","v":0.26379999999999998}]
["S",0,1,8,0,0,22,0,0,"Serviço","1.8.22.","SINAPI-I","38092",{"$f":"IF($A93=\"S\",Referencia.Descricao,\"(digite a descrição aqui)\")","v":"ESPELHO / PLACA DE 1 POSTO 4\" X 2\", PARA INSTALACAO DE TOMADAS E INTERRUPTORES"},{"$f":"Referencia.Unidade","v":"UN    "},{"$f":"OFFSET(PLQ!$E$12,ROW($P93)-ROW(P$12),0)","v":12},2.56,"BDI 1",3.24,38.880000000000003,"",{"$f":"IF(OR($A93=0,$A93=\"S\",$A93>CFF!$A$9),\"\",MAX(V$12:OFFSET(V93,-1,0))+1)","v":""},"SINAPI-I-38092",9480,{"$f":"IF(Import.Desoneracao=\"sim\",Referencia.Desonerado,Referencia.NaoDesonerado)","v":2.56},{"$f":"ROUND(IF(ISNUMBER(R93),R93,IF(LEFT(R93,3)=\"BDI\",HLOOKUP(R93,DADOS!$T$37:$X$38,2,FALSE),0)),15-11*$X$5)","v":0.26379999999999998}]
["S",0,1,8,0,0,23,0,0,"Serviço","1.8.23.","SINAPI-I","39795",{"$f":"IF($A94=\"S\",Referencia.Descricao,\"(digite a descrição aqui)\")","v":"QUADRO DE DISTRIBUICAO, SEM BARRAMENTO, EM PVC, DE EMBUTIR, PARA 6 DISJUNTORES NEMA OU 8 DISJUNTORES DIN"},{"$f":"Referencia.Unidade","v":"UN    "},{"$f":"OFFSET(PLQ!$E$12,ROW($P94)-ROW(P$12),0)","v":1},61.92,"BDI 1",78.25,78.25,"",{"$f":"IF(OR($A94=0,$A94=\"S\",$A94>CFF!$A$9),\"\",MAX(V$12:OFFSET(V94,-1,0))+1)","v":""},"SINAPI-I-39795",11219,{"$f":"IF(Import.Desoneracao=\"sim\",Referencia.Desonerado,Referencia.NaoDesonerado)","v":61.92},{"$f":"ROUND(IF(ISNUMBER(R94),R94,IF(LEFT(R94,3)=\"BDI\",HLOOKUP(R94,DADOS!$T$37:$X$38,2,FALSE),0)),15-11*$X$5)","v":0.26379999999999998}]
[2,22,1,9,0,0,0,47,22,"Nível 2","1.9.",null,null,"ISNSTALAÇÕES  HIDRÁULICAS ",{"$f":"Referencia.Unidade","v":""},{"$f":"OFFSET(PLQ!$E$12,ROW($P95)-ROW(P$12),0)","v":0},null,"BDI 1",0,3132.08,"",{"$f":"IF(OR($A95=0,$A95=\"S\",$A95>CFF!$A$9),\"\",MAX(V$12:OFFSET(V95,-1,0))+1)","v":10},false,"X",{"$f":"IF(Import.Desoneracao=\"sim\",Referencia.Desonerado,Referencia.NaoDesonerado)","v":0},{"$f":"ROUND(IF(ISNUMBER(R95),R95,IF(LEFT(R95,3)=\"BDI\",HLOOKUP(R95,DADOS!$T$37:$X$38,2,FALSE),0)),15-11*$X$5)","v":0.26379999999999998}]
["S",0,1,9,0,0,1,0,0,"Serviço","1.9.1.","SINAPI","94689",{"$f":"IF($A96=\"S\",Referencia.Descricao,\"(digite a descrição aqui)\")","v":"TÊ COM BUCHA DE LATÃO NA BOLSA CENTRAL, PVC, SOLDÁVEL, DN  25 MM X 3/4 , INSTALADO EM RESERVAÇÃO DE ÁGUA DE EDIFICAÇÃO QUE POSSUA RESERVATÓRIO DE FIBRA/FIBROCIMENTO   FORNECIMENTO E INSTALAÇÃO. AF_06/2016"},{"$f":"Referencia.Unidade","v":"UN"},{"$f":"OFFSET(PLQ!$E$12,ROW($P96)-ROW(P$12),0)","v":3},14.73,"BDI 1",18.62,55.86,"",{"$f":"IF(OR($A96=0,$A96=\"S\",$A96>CFF!$A$9),\"\",MAX(V$12:OFFSET(V96,-1,0))+1)","v":""},"SINAPI-94689",4430,{"$f":"IF(Import.Desoneracao=\"sim\",Referencia.Desonerado,Referencia.NaoDesonerado)","v":14.73},{"$f":"ROUND(IF(ISNUMBER(R96),R96,IF(LEFT(R96,3)=\"BDI\",HLOOKUP(R96,DADOS!$T$37:$X$38,2,FALSE),0)),15-11*$X$5)","v":0.26379999999999998}]
["S",0,1,9,0,0,2,0,0,"Serviço","1.9.2.","SINAPI","89443",{"$f":"IF($A97=\"S\",Referencia.Descricao,\"(digite a descrição aqui)\")","v":"TE, PVC, SOLDÁVEL, DN 32MM, INSTALADO EM RAMAL DE DISTRIBUIÇÃO DE ÁGUA - FORNECIMENTO E INSTALAÇÃO. AF_06/2022"},{"$f":"Referencia.Unidade","v":"UN"},{"$f":"OFFSET(PLQ!$E$12,ROW($P97)-ROW(P$12),0)","v":1},16.7,"BDI 1",21.11,21.11,"",{"$f":"IF(OR($A97=0,$A97=\"S\",$A97>CFF!$A$9),\"\",MAX(V$12:OFFSET(V97,-1,0))+1)","v":""},"SINAPI-89443",3788,{"$f":"IF(Import.Desoneracao=\"sim\",Referencia.Desonerado,Referencia.NaoDesonerado)","v":16.7},{"$f":"ROUND(IF(ISNUMBER(R97),R97,IF(LEFT(R97,3)=\"BDI\",HLOOKUP(R97,DADOS!$T$37:$X$38,2,FALSE),0)),15-11*$X$5)","v":0.26379999999999998}]
["S",0,1,9,0,0,3,0,0,"Serviço","1.9.3.","SINAPI","89440",{"$f":"IF($A98=\"S\",Referencia.Descricao,\"(digite a descrição aqui)\")","v":"TE, PVC, SOLDÁVEL, DN 25MM, INSTALADO EM RAMAL DE DISTRIBUIÇÃO DE ÁGUA - FORNECIMENTO E INSTALAÇÃO. AF_06/2022"},{"$f":"Referencia.Unidade","v":"UN"},{"$f":"OFFSET(PLQ!$E$12,ROW($P98)-ROW(P$12),0)","v":2},11.54,"BDI 1",14.58,29.16,"",{"$f":"IF(OR($A98=0,$A98=\"S\",$A98>CFF!$A$9),\"\",MAX(V$12:OFFSET(V98,-1,0))+1)","v":""},"SINAPI-89440",3786,{"$f":"IF(Import.Desoneracao=\"sim\",Referencia.Desonerado,Referencia.NaoDesonerado)","v":11.54},{"$f":"ROUND(IF(ISNUMBER(R98),R98,IF(LEFT(R98,3)=\"BDI\",HLOOKUP(R98,DADOS!$T$37:$X$38,2,FALSE),0)),15-11*$X$5)","v":0.26379999999999998}]
["S",0,1,9,0,0,4,0,0,"Serviço","1.9.4.","SINAPI","89427",{"$f":"IF($A99=\"S\",Referencia.Descricao,\"(digite a descrição aqui)\")","v":"LUVA COM BUCHA DE LATÃO, PVC, SOLDÁVEL, DN 25MM X 3/4 , INSTALADO EM RAMAL DE DISTRIBUIÇÃO DE ÁGUA - FORNECIMENTO E INSTALAÇÃO. AF_06/2022"},{"$f":"Referencia.Unidade","v":"UN"},{"$f":"OFFSET(PLQ!$E$12,ROW($P99)-ROW(P$12),0)","v":1},12.31,"BDI 1",15.56,15.56,"",{"$f":"IF(OR($A99=0,$A99=\"S\",$A99>CFF!$A$9),\"\",MAX(V$12:OFFSET(V99,-1,0))+1)","v":""},"SINAPI-89427",3773,{"$f":"IF(Import.Desoneracao=\"sim\",Referencia.Desonerado,Referencia.NaoDesonerado)","v":12.31},{"$f":"ROUND(IF(ISNUMBER(R99),R99,IF(LEFT(R99,3)=\"BDI\",HLOOKUP(R99,DADOS!$T$37:$X$38,2,FALSE),0)),15-11*$X$5)","v":0.26379999999999998}]
["S",0,1,9,0,0,5,0,0,"Serviço","1.9.5.","SINAPI","90373",{"$f":"IF($A100=\"S\",Referencia.Descricao,\"(digite a descrição aqui)\")","v":"JOELHO 90 GRAUS COM BUCHA DE LATÃO, PVC, SOLDÁVEL, DN 25MM, X 1/2  INSTALADO EM RAMAL OU SUB-RAMAL DE ÁGUA - FORNECIMENTO E INSTALAÇÃO. AF_06/2022"},{"$f":"Referencia.Unidade","v":"UN"},{"$f":"OFFSET(PLQ!$E$12,ROW($P100)-ROW(P$12),0)","v":2},13.1,"BDI 1",16.559999999999999,33.119999999999997,"",{"$f":"IF(OR($A100=0,$A100=\"S\",$A100>CFF!$A$9),\"\",MAX(V$12:OFFSET(V100,-1,0))+1)","v":""},"SINAPI-90373",4110,{"$f":"IF(Import.Desoneracao=\"sim\",Referencia.Desonerado,Referencia.NaoDesonerado)","v":13.1},{"$f":"ROUND(IF(ISNUMBER(R100),R100,IF(LEFT(R100,3)=\"BDI\",HLOOKUP(R100,DADOS!$T$37:$X$38,2,FALSE),0)),15-11*$X$5)","v":0.26379999999999998}]
["S",0,1,9,0,0,6,0,0,"Serviço","1.9.6.","SINAPI","89413",{"$f":"IF($A101=\"S\",Referencia.Descricao,\"(digite a descrição aqui)\")","v":"JOELHO 90 GRAUS, PVC, SOLDÁVEL, DN 32MM, INSTALADO EM RAMAL DE DISTRIBUIÇÃO DE ÁGUA - FORNECIMENTO E INSTALAÇÃO. AF_06/2022"},{"$f":"Referencia.Unidade","v":"UN"},{"$f":"OFFSET(PLQ!$E$12,ROW($P101)-ROW(P$12),0)","v":9},11.84,"BDI 1",{"$f":"IF($A101=\"S\",IF($Q$10=\"Preço Unitário (R$)\",PO.CustoUnitario,ROUND(PO.CustoUnitario*(1+$Z101),15-13*$X$6)),0)","v":14.96},{"$f":"IF($A101=\"S\",VTOTAL1,IF($A101=0,0,ROUND(SomaAgrup,15-13*$X$7)))","v":134.63999999999999},"",{"$f":"IF(OR($A101=0,$A101=\"S\",$A101>CFF!$A$9),\"\",MAX(V$12:OFFSET(V101,-1,0))+1)","v":""},"SINAPI-89413",{"$f":"IF(AND(Fonte<>\"\",Código<>\"\"),MATCH(Fonte&\" \"&IF(Fonte=\"sinapi\",SUBSTITUTE(SUBSTITUTE(Código,\"/00\",\"/\"),\"/0\",\"/\"),Código),INDIRECT(\"'[Referência \"&_xlnm.Database&\".xls]Banco'!$a:$a\"),0),\"X\")","v":3761},{"$f":"IF(Import.Desoneracao=\"sim\",Referencia.Desonerado,Referencia.NaoDesonerado)","v":11.84},{"$f":"ROUND(IF(ISNUMBER(R101),R101,IF(LEFT(R101,3)=\"BDI\",HLOOKUP(R101,DADOS!$T$37:$X$38,2,FALSE),0)),15-11*$X$5)","v":0.26379999999999998}]
["S",0,1,9,0,0,7,0,0,"Serviço","1.9.7.","SINAPI","89408",{"$f":"IF($A102=\"S\",Referencia.Descricao,\"(digite a descrição aqui)\")","v":"JOELHO 90 GRAUS, PVC, SOLDÁVEL, DN 25MM, INSTALADO EM RAMAL DE DISTRIBUIÇÃO DE ÁGUA - FORNECIMENTO E INSTALAÇÃO. AF_06/2022"},{"$f":"Referencia.Unidade","v":"UN"},{"$f":"OFFSET(PLQ!$E$12,ROW($P102)-ROW(P$12),0)","v":6},8.3000000000000007,"BDI 1",10.49,62.94,"",{"$f":"IF(OR($A102=0,$A102=\"S\",$A102>CFF!$A$9),\"\",MAX(V$12:OFFSET(V102,-1,0))+1)","v":""},"SINAPI-89408",3756,{"$f":"IF(Import.Desoneracao=\"sim\",Referencia.Desonerado,Referencia.NaoDesonerado)","v":8.3000000000000007},{"$f":"ROUND(IF(ISNUMBER(R102),R102,IF(LEFT(R102,3)=\"BDI\",HLOOKUP(R102,DADOS!$T$37:$X$38,2,FALSE),0)),15-11*$X$5)","v":0.26379999999999998}]
["S",0,1,9,0,0,8,0,0,"Serviço","1.9.8.","SINAPI","89532",{"$f":"IF($A103=\"S\",Referencia.Descricao,\"(digite a descrição aqui)\")","v":"LUVA DE REDUÇÃO, PVC, SOLDÁVEL, DN 32MM X 25MM, INSTALADO EM PRUMADA DE ÁGUA - FORNECIMENTO E INSTALAÇÃO. AF_06/2022"},{"$f":"Referencia.Unidade","v":"UN"},{"$f":"OFFSET(PLQ!$E$12,ROW($P103)-ROW(P$12),0)","v":4},7.32,"BDI 1",9.25,37,"",{"$f":"IF(OR($A103=0,$A103=\"S\",$A103>CFF!$A$9),\"\",MAX(V$12:OFFSET(V103,-1,0))+1)","v":""},"SINAPI-89532",3830,{"$f":"IF(Import.Desoneracao=\"sim\",Referencia.Desonerado,Referencia.NaoDesonerado)","v":7.32},{"$f":"ROUND(IF(ISNUMBER(R103),R103,IF(LEFT(R103,3)=\"BDI\",HLOOKUP(R103,DADOS!$T$37:$X$38,2,FALSE),0)),15-11*$X$5)","v":0.26379999999999998}]
["S",0,1,9,0,0,9,0,0,"Serviço","1.9.9.","SINAPI","89356",{"$f":"IF($A104=\"S\",Referencia.Descricao,\"(digite a descrição aqui)\")","v":"TUBO, PVC, SOLDÁVEL, DN 25MM, INSTALADO EM RAMAL OU SUB-RAMAL DE ÁGUA - FORNECIMENTO E INSTALAÇÃO. AF_06/2022"},{"$f":"Referencia.Unidade","v":"M"},{"$f":"OFFSET(PLQ!$E$12,ROW($P104)-ROW(P$12),0)","v":18},22.42,"BDI 1",28.33,509.94,"",{"$f":"IF(OR($A104=0,$A104=\"S\",$A104>CFF!$A$9),\"\",MAX(V$12:OFFSET(V104,-1,0))+1)","v":""},"SINAPI-89356",3448,{"$f":"IF(Import.Desoneracao=\"sim\",Referencia.Desonerado,Referencia.NaoDesonerado)","v":22.42},{"$f":"ROUND(IF(ISNUMBER(R104),R104,IF(LEFT(R104,3)=\"BDI\",HLOOKUP(R104,DADOS!$T$37:$X$38,2,FALSE),0)),15-11*$X$5)","v":0.26379999999999998}]
["S",0,1,9,0,0,10,0,0,"Serviço","1.9.10.","SINAPI","89357",{"$f":"IF($A105=\"S\",Referencia.Descricao,\"(digite a descrição aqui)\")","v":"TUBO, PVC, SOLDÁVEL, DN 32MM, INSTALADO EM RAMAL OU SUB-RAMAL DE ÁGUA - FORNECIMENTO E INSTALAÇÃO. AF_06/2022"},{"$f":"Referencia.Unidade","v":"M"},{"$f":"OFFSET(PLQ!$E$12,ROW($P105)-ROW(P$12),0)","v":18},31.46,"BDI 1",39.76,715.68,"",{"$f":"IF(OR($A105=0,$A105=\"S\",$A105>CFF!$A$9),\"\",MAX(V$12:OFFSET(V105,-1,0))+1)","v":""},"SINAPI-89357",3449,{"$f":"IF(Import.Desoneracao=\"sim\",Referencia.Desonerado,Referencia.NaoDesonerado)","v":31.46},{"$f":"ROUND(IF(ISNUMBER(R105),R105,IF(LEFT(R105,3)=\"BDI\",HLOOKUP(R105,DADOS!$T$37:$X$38,2,FALSE),0)),15-11*$X$5)","v":0.26379999999999998}]
["S",0,1,9,0,0,11,0,0,"Serviço","1.9.11.","SINAPI","89984",{"$f":"IF($A106=\"S\",Referencia.Descricao,\"(digite a descrição aqui)\")","v":"REGISTRO DE PRESSÃO BRUTO, LATÃO, ROSCÁVEL, 1/2\", COM ACABAMENTO E CANOPLA CROMADOS - FORNECIMENTO E INSTALAÇÃO. AF_08/2021"},{"$f":"Referencia.Unidade","v":"UN"},{"$f":"OFFSET(PLQ!$E$12,ROW($P106)-ROW(P$12),0)","v":1},99.25,"BDI 1",125.43,125.43,"",{"$f":"IF(OR($A106=0,$A106=\"S\",$A106>CFF!$A$9),\"\",MAX(V$12:OFFSET(V106,-1,0))+1)","v":""},"SINAPI-89984",5226,{"$f":"IF(Import.Desoneracao=\"sim\",Referencia.Desonerado,Referencia.NaoDesonerado)","v":99.25},{"$f":"ROUND(IF(ISNUMBER(R106),R106,IF(LEFT(R106,3)=\"BDI\",HLOOKUP(R106,DADOS!$T$37:$X$38,2,FALSE),0)),15-11*$X$5)","v":0.26379999999999998}]
["S",0,1,9,0,0,12,0,0,"Serviço","1.9.12.","SINAPI","89987",{"$f":"IF($A107=\"S\",Referencia.Descricao,\"(digite a descrição aqui)\")","v":"REGISTRO DE GAVETA BRUTO, LATÃO, ROSCÁVEL, 3/4\", COM ACABAMENTO E CANOPLA CROMADOS - FORNECIMENTO E INSTALAÇÃO. AF_08/2021"},{"$f":"Referencia.Unidade","v":"UN"},{"$f":"OFFSET(PLQ!$E$12,ROW($P107)-ROW(P$12),0)","v":2},109.75,"BDI 1",138.69999999999999,277.39999999999998,"",{"$f":"IF(OR($A107=0,$A107=\"S\",$A107>CFF!$A$9),\"\",MAX(V$12:OFFSET(V107,-1,0))+1)","v":""},"SINAPI-89987",5229,{"$f":"IF(Import.Desoneracao=\"sim\",Referencia.Desonerado,Referencia.NaoDesonerado)","v":109.75},{"$f":"ROUND(IF(ISNUMBER(R107),R107,IF(LEFT(R107,3)=\"BDI\",HLOOKUP(R107,DADOS!$T$37:$X$38,2,FALSE),0)),15-11*$X$5)","v":0.26379999999999998}]
["S",0,1,9,0,0,13,0,0,"Serviço","1.9.13.","SINAPI","94490",{"$f":"IF($A108=\"S\",Referencia.Descricao,\"(digite a descrição aqui)\")","v":"REGISTRO DE ESFERA, PVC, SOLDÁVEL, COM VOLANTE, DN  32 MM - FORNECIMENTO E INSTALAÇÃO. AF_08/2021"},{"$f":"Referencia.Unidade","v":"UN"},{"$f":"OFFSET(PLQ!$E$12,ROW($P108)-ROW(P$12),0)","v":2},67.05,"BDI 1",84.74,169.48,"",{"$f":"IF(OR($A108=0,$A108=\"S\",$A108>CFF!$A$9),\"\",MAX(V$12:OFFSET(V108,-1,0))+1)","v":""},"SINAPI-94490",5232,{"$f":"IF(Import.Desoneracao=\"sim\",Referencia.Desonerado,Referencia.NaoDesonerado)","v":67.05},{"$f":"ROUND(IF(ISNUMBER(R108),R108,IF(LEFT(R108,3)=\"BDI\",HLOOKUP(R108,DADOS!$T$37:$X$38,2,FALSE),0)),15-11*$X$5)","v":0.26379999999999998}]
["S",0,1,9,0,0,14,{"$f":"IF(OR($A109=\"S\",$A109=0),0,MATCH(0,OFFSET($B109,1,$A109,ROW($A$142)-ROW($A109)),0))","v":0},{"$f":"IF(OR($A109=\"S\",$A109=0),0,MATCH(OFFSET($B109,0,$A109)+1,OFFSET($B109,1,$A109,ROW($A$142)-ROW($A109)),0))","v":0},"Serviço","1.9.14.","SINAPI","94489",{"$f":"IF($A109=\"S\",Referencia.Descricao,\"(digite a descrição aqui)\")","v":"REGISTRO DE ESFERA, PVC, SOLDÁVEL, COM VOLANTE, DN  25 MM - FORNECIMENTO E INSTALAÇÃO. AF_08/2021"},{"$f":"Referencia.Unidade","v":"UN"},{"$f":"OFFSET(PLQ!$E$12,ROW($P109)-ROW(P$12),0)","v":1},44.24,"BDI 1",55.91,55.91,"",{"$f":"IF(OR($A109=0,$A109=\"S\",$A109>CFF!$A$9),\"\",MAX(V$12:OFFSET(V109,-1,0))+1)","v":""},"SINAPI-94489",5231,{"$f":"IF(Import.Desoneracao=\"sim\",Referencia.Desonerado,Referencia.NaoDesonerado)","v":44.24},{"$f":"ROUND(IF(ISNUMBER(R109),R109,IF(LEFT(R109,3)=\"BDI\",HLOOKUP(R109,DADOS!$T$37:$X$38,2,FALSE),0)),15-11*$X$5)","v":0.26379999999999998}]
["S",0,1,9,0,0,15,0,0,"Serviço","1.9.15.","SINAPI","100860",{"$f":"IF($A110=\"S\",Referencia.Descricao,\"(digite a descrição aqui)\")","v":"CHUVEIRO ELÉTRICO COMUM CORPO PLÁSTICO, TIPO DUCHA \u0096 FORNECIMENTO E INSTALAÇÃO. AF_01/2020"},{"$f":"Referencia.Unidade","v":"UN"},{"$f":"OFFSET(PLQ!$E$12,ROW($P110)-ROW(P$12),0)","v":1},87.06,"BDI 1",110.03,110.03,"",{"$f":"IF(OR($A110=0,$A110=\"S\",$A110>CFF!$A$9),\"\",MAX(V$12:OFFSET(V110,-1,0))+1)","v":""},"SINAPI-100860",5144,{"$f":"IF(Import.Desoneracao=\"sim\",Referencia.Desonerado,Referencia.NaoDesonerado)","v":87.06},{"$f":"ROUND(IF(ISNUMBER(R110),R110,IF(LEFT(R110,3)=\"BDI\",HLOOKUP(R110,DADOS!$T$37:$X$38,2,FALSE),0)),15-11*$X$5)","v":0.26379999999999998}]
["S",0,1,9,0,0,16,0,0,"Serviço","1.9.16.","SINAPI","94795",{"$f":"IF($A111=\"S\",Referencia.Descricao,\"(digite a descrição aqui)\")","v":"TORNEIRA DE BOIA PARA CAIXA D'ÁGUA, ROSCÁVEL, 1/2\" - FORNECIMENTO E INSTALAÇÃO. AF_08/2021"},{"$f":"Referencia.Unidade","v":"UN"},{"$f":"OFFSET(PLQ!$E$12,ROW($P111)-ROW(P$12),0)","v":1},69.38,"BDI 1",87.68,87.68,"",{"$f":"IF(OR($A111=0,$A111=\"S\",$A111>CFF!$A$9),\"\",MAX(V$12:OFFSET(V111,-1,0))+1)","v":""},"SINAPI-94795",5246,{"$f":"IF(Import.Desoneracao=\"sim\",Referencia.Desonerado,Referencia.NaoDesonerado)","v":69.38},{"$f":"ROUND(IF(ISNUMBER(R111),R111,IF(LEFT(R111,3)=\"BDI\",HLOOKUP(R111,DADOS!$T$37:$X$38,2,FALSE),0)),15-11*$X$5)","v":0.26379999999999998}]
["S",0,1,9,0,0,17,0,0,"Serviço","1.9.17.","SINAPI-I","13415",{"$f":"IF($A112=\"S\",Referencia.Descricao,\"(digite a descrição aqui)\")","v":"TORNEIRA DE MESA/BANCADA, PARA LAVATORIO, FIXA, METALICA CROMADA, PADRAO POPULAR, 1/2 \" OU 3/4 \" (REF 1193)"},{"$f":"Referencia.Unidade","v":"UN    "},{"$f":"OFFSET(PLQ!$E$12,ROW($P112)-ROW(P$12),0)","v":1},108.11,"BDI 1",136.63,136.63,"",{"$f":"IF(OR($A112=0,$A112=\"S\",$A112>CFF!$A$9),\"\",MAX(V$12:OFFSET(V112,-1,0))+1)","v":""},"SINAPI-I-13415",11911,{"$f":"IF(Import.Desoneracao=\"sim\",Referencia.Desonerado,Referencia.NaoDesonerado)","v":108.11},{"$f":"ROUND(IF(ISNUMBER(R112),R112,IF(LEFT(R112,3)=\"BDI\",HLOOKUP(R112,DADOS!$T$37:$X$38,2,FALSE),0)),15-11*$X$5)","v":0.26379999999999998}]
["S",0,1,9,0,0,18,0,0,"Serviço","1.9.18.","SINAPI","102605",{"$f":"IF($A113=\"S\",Referencia.Descricao,\"(digite a descrição aqui)\")","v":"CAIXA D´ÁGUA EM POLIETILENO, 500 LITROS - FORNECIMENTO E INSTALAÇÃO. AF_06/2021"},{"$f":"Referencia.Unidade","v":"UN"},{"$f":"OFFSET(PLQ!$E$12,ROW($P113)-ROW(P$12),0)","v":1},291.44,"BDI 1",368.32,368.32,"",{"$f":"IF(OR($A113=0,$A113=\"S\",$A113>CFF!$A$9),\"\",MAX(V$12:OFFSET(V113,-1,0))+1)","v":""},"SINAPI-102605",5028,{"$f":"IF(Import.Desoneracao=\"sim\",Referencia.Desonerado,Referencia.NaoDesonerado)","v":291.44},{"$f":"ROUND(IF(ISNUMBER(R113),R113,IF(LEFT(R113,3)=\"BDI\",HLOOKUP(R113,DADOS!$T$37:$X$38,2,FALSE),0)),15-11*$X$5)","v":0.26379999999999998}]
["S",0,1,9,0,0,19,0,0,"Serviço","1.9.19.","SINAPI","94785",{"$f":"IF($A114=\"S\",Referencia.Descricao,\"(digite a descrição aqui)\")","v":"ADAPTADOR COM FLANGES LIVRES, PVC, SOLDÁVEL LONGO, DN 32 MM X 1 , INSTALADO EM RESERVAÇÃO DE ÁGUA DE EDIFICAÇÃO QUE POSSUA RESERVATÓRIO DE FIBRA/FIBROCIMENTO   FORNECIMENTO E INSTALAÇÃO. AF_06/2016"},{"$f":"Referencia.Unidade","v":"UN"},{"$f":"OFFSET(PLQ!$E$12,ROW($P114)-ROW(P$12),0)","v":3},24.85,"BDI 1",31.41,94.23,"",{"$f":"IF(OR($A114=0,$A114=\"S\",$A114>CFF!$A$9),\"\",MAX(V$12:OFFSET(V114,-1,0))+1)","v":""},"SINAPI-94785",4498,{"$f":"IF(Import.Desoneracao=\"sim\",Referencia.Desonerado,Referencia.NaoDesonerado)","v":24.85},{"$f":"ROUND(IF(ISNUMBER(R114),R114,IF(LEFT(R114,3)=\"BDI\",HLOOKUP(R114,DADOS!$T$37:$X$38,2,FALSE),0)),15-11*$X$5)","v":0.26379999999999998}]
["S",0,1,9,0,0,20,0,0,"Serviço","1.9.20.","SINAPI","89391",{"$f":"IF($A115=\"S\",Referencia.Descricao,\"(digite a descrição aqui)\")","v":"ADAPTADOR CURTO COM BOLSA E ROSCA PARA REGISTRO, PVC, SOLDÁVEL, DN 32MM X 1 , INSTALADO EM RAMAL OU SUB-RAMAL DE ÁGUA - FORNECIMENTO E INSTALAÇÃO. AF_06/2022"},{"$f":"Referencia.Unidade","v":"UN"},{"$f":"OFFSET(PLQ!$E$12,ROW($P115)-ROW(P$12),0)","v":4},8.58,"BDI 1",10.84,43.36,"",{"$f":"IF(OR($A115=0,$A115=\"S\",$A115>CFF!$A$9),\"\",MAX(V$12:OFFSET(V115,-1,0))+1)","v":""},"SINAPI-89391",3742,{"$f":"IF(Import.Desoneracao=\"sim\",Referencia.Desonerado,Referencia.NaoDesonerado)","v":8.58},{"$f":"ROUND(IF(ISNUMBER(R115),R115,IF(LEFT(R115,3)=\"BDI\",HLOOKUP(R115,DADOS!$T$37:$X$38,2,FALSE),0)),15-11*$X$5)","v":0.26379999999999998}]
["S",0,1,9,0,0,21,0,0,"Serviço","1.9.21.","SINAPI","89383",{"$f":"IF($A116=\"S\",Referencia.Descricao,\"(digite a descrição aqui)\")","v":"ADAPTADOR CURTO COM BOLSA E ROSCA PARA REGISTRO, PVC, SOLDÁVEL, DN 25MM X 3/4 , INSTALADO EM RAMAL OU SUB-RAMAL DE ÁGUA - FORNECIMENTO E INSTALAÇÃO. AF_06/2022"},{"$f":"Referencia.Unidade","v":"UN"},{"$f":"OFFSET(PLQ!$E$12,ROW($P116)-ROW(P$12),0)","v":6},6.41,"BDI 1",8.1,48.6,"",{"$f":"IF(OR($A116=0,$A116=\"S\",$A116>CFF!$A$9),\"\",MAX(V$12:OFFSET(V116,-1,0))+1)","v":""},"SINAPI-89383",3735,{"$f":"IF(Import.Desoneracao=\"sim\",Referencia.Desonerado,Referencia.NaoDesonerado)","v":6.41},{"$f":"ROUND(IF(ISNUMBER(R116),R116,IF(LEFT(R116,3)=\"BDI\",HLOOKUP(R116,DADOS!$T$37:$X$38,2,FALSE),0)),15-11*$X$5)","v":0.26379999999999998}]
[2,25,1,10,0,0,0,25,{"$error":"#N/A"},"Nível 2","1.10.",null,null,"INSTALAÇÕES SANITÁRIAS",{"$f":"Referencia.Unidade","v":""},{"$f":"OFFSET(PLQ!$E$12,ROW($P117)-ROW(P$12),0)","v":0},null,"BDI 1",0,5534.87,"",{"$f":"IF(OR($A117=0,$A117=\"S\",$A117>CFF!$A$9),\"\",MAX(V$12:OFFSET(V117,-1,0))+1)","v":11},false,"X",{"$f":"IF(Import.Desoneracao=\"sim\",Referencia.Desonerado,Referencia.NaoDesonerado)","v":0},{"$f":"ROUND(IF(ISNUMBER(R117),R117,IF(LEFT(R117,3)=\"BDI\",HLOOKUP(R117,DADOS!$T$37:$X$38,2,FALSE),0)),15-11*$X$5)","v":0.26379999999999998}]
["S",0,1,10,0,0,1,0,0,"Serviço","1.10.1.","SINAPI","89796",{"$f":"IF($A118=\"S\",Referencia.Descricao,\"(digite a descrição aqui)\")","v":"TE, PVC, SERIE NORMAL, ESGOTO PREDIAL, DN 100 X 100 MM, JUNTA ELÁSTICA, FORNECIDO E INSTALADO EM RAMAL DE DESCARGA OU RAMAL DE ESGOTO SANITÁRIO. AF_08/2022"},{"$f":"Referencia.Unidade","v":"UN"},{"$f":"OFFSET(PLQ!$E$12,ROW($P118)-ROW(P$12),0)","v":1},44.08,"BDI 1",55.71,55.71,"",{"$f":"IF(OR($A118=0,$A118=\"S\",$A118>CFF!$A$9),\"\",MAX(V$12:OFFSET(V118,-1,0))+1)","v":""},"SINAPI-89796",4047,{"$f":"IF(Import.Desoneracao=\"sim\",Referencia.Desonerado,Referencia.NaoDesonerado)","v":44.08},{"$f":"ROUND(IF(ISNUMBER(R118),R118,IF(LEFT(R118,3)=\"BDI\",HLOOKUP(R118,DADOS!$T$37:$X$38,2,FALSE),0)),15-11*$X$5)","v":0.26379999999999998}]
["S",0,1,10,0,0,2,0,0,"Serviço","1.10.2.","SINAPI-I","11655",{"$f":"IF($A119=\"S\",Referencia.Descricao,\"(digite a descrição aqui)\")","v":"TE SANITARIO DE REDUCAO, PVC, DN 100 X 50 MM, SERIE NORMAL, PARA ESGOTO PREDIAL"},{"$f":"Referencia.Unidade","v":"UN    "},{"$f":"OFFSET(PLQ!$E$12,ROW($P119)-ROW(P$12),0)","v":1},19.13,"BDI 1",24.18,24.18,"",{"$f":"IF(OR($A119=0,$A119=\"S\",$A119>CFF!$A$9),\"\",MAX(V$12:OFFSET(V119,-1,0))+1)","v":""},"SINAPI-I-11655",11672,{"$f":"IF(Import.Desoneracao=\"sim\",Referencia.Desonerado,Referencia.NaoDesonerado)","v":19.13},{"$f":"ROUND(IF(ISNUMBER(R119),R119,IF(LEFT(R119,3)=\"BDI\",HLOOKUP(R119,DADOS!$T$37:$X$38,2,FALSE),0)),15-11*$X$5)","v":0.26379999999999998}]
["S",0,1,10,0,0,3,0,0,"Serviço","1.10.3.","SINAPI","89786",{"$f":"IF($A120=\"S\",Referencia.Descricao,\"(digite a descrição aqui)\")","v":"TE, PVC, SERIE NORMAL, ESGOTO PREDIAL, DN 75 X 75 MM, JUNTA ELÁSTICA, FORNECIDO E INSTALADO EM RAMAL DE DESCARGA OU RAMAL DE ESGOTO SANITÁRIO. AF_08/2022"},{"$f":"Referencia.Unidade","v":"UN"},{"$f":"OFFSET(PLQ!$E$12,ROW($P120)-ROW(P$12),0)","v":1},39.67,"BDI 1",50.13,50.13,"",{"$f":"IF(OR($A120=0,$A120=\"S\",$A120>CFF!$A$9),\"\",MAX(V$12:OFFSET(V120,-1,0))+1)","v":""},"SINAPI-89786",4037,{"$f":"IF(Import.Desoneracao=\"sim\",Referencia.Desonerado,Referencia.NaoDesonerado)","v":39.67},{"$f":"ROUND(IF(ISNUMBER(R120),R120,IF(LEFT(R120,3)=\"BDI\",HLOOKUP(R120,DADOS!$T$37:$X$38,2,FALSE),0)),15-11*$X$5)","v":0.26379999999999998}]
["S",0,1,10,0,0,4,0,0,"Serviço","1.10.4.","SINAPI","89778",{"$f":"IF($A121=\"S\",Referencia.Descricao,\"(digite a descrição aqui)\")","v":"LUVA SIMPLES, PVC, SERIE NORMAL, ESGOTO PREDIAL, DN 100 MM, JUNTA ELÁSTICA, FORNECIDO E INSTALADO EM RAMAL DE DESCARGA OU RAMAL DE ESGOTO SANITÁRIO. AF_08/2022"},{"$f":"Referencia.Unidade","v":"UN"},{"$f":"OFFSET(PLQ!$E$12,ROW($P121)-ROW(P$12),0)","v":16},18.53,"BDI 1",23.42,374.72,"",{"$f":"IF(OR($A121=0,$A121=\"S\",$A121>CFF!$A$9),\"\",MAX(V$12:OFFSET(V121,-1,0))+1)","v":""},"SINAPI-89778",4029,{"$f":"IF(Import.Desoneracao=\"sim\",Referencia.Desonerado,Referencia.NaoDesonerado)","v":18.53},{"$f":"ROUND(IF(ISNUMBER(R121),R121,IF(LEFT(R121,3)=\"BDI\",HLOOKUP(R121,DADOS!$T$37:$X$38,2,FALSE),0)),15-11*$X$5)","v":0.26379999999999998}]
["S",0,1,10,0,0,5,0,0,"Serviço","1.10.5.","SINAPI","89774",{"$f":"IF($A122=\"S\",Referencia.Descricao,\"(digite a descrição aqui)\")","v":"LUVA SIMPLES, PVC, SERIE NORMAL, ESGOTO PREDIAL, DN 75 MM, JUNTA ELÁSTICA, FORNECIDO E INSTALADO EM RAMAL DE DESCARGA OU RAMAL DE ESGOTO SANITÁRIO. AF_08/2022"},{"$f":"Referencia.Unidade","v":"UN"},{"$f":"OFFSET(PLQ!$E$12,ROW($P122)-ROW(P$12),0)","v":5},16.170000000000002,"BDI 1",20.440000000000001,102.2,"",{"$f":"IF(OR($A122=0,$A122=\"S\",$A122>CFF!$A$9),\"\",MAX(V$12:OFFSET(V122,-1,0))+1)","v":""},"SINAPI-89774",4026,{"$f":"IF(Import.Desoneracao=\"sim\",Referencia.Desonerado,Referencia.NaoDesonerado)","v":16.170000000000002},{"$f":"ROUND(IF(ISNUMBER(R122),R122,IF(LEFT(R122,3)=\"BDI\",HLOOKUP(R122,DADOS!$T$37:$X$38,2,FALSE),0)),15-11*$X$5)","v":0.26379999999999998}]
["S",0,1,10,0,0,6,0,0,"Serviço","1.10.6.","SINAPI","89753",{"$f":"IF($A123=\"S\",Referencia.Descricao,\"(digite a descrição aqui)\")","v":"LUVA SIMPLES, PVC, SERIE NORMAL, ESGOTO PREDIAL, DN 50 MM, JUNTA ELÁSTICA, FORNECIDO E INSTALADO EM RAMAL DE DESCARGA OU RAMAL DE ESGOTO SANITÁRIO. AF_08/2022"},{"$f":"Referencia.Unidade","v":"UN"},{"$f":"OFFSET(PLQ!$E$12,ROW($P123)-ROW(P$12),0)","v":10},9.48,"BDI 1",11.98,119.8,"",{"$f":"IF(OR($A123=0,$A123=\"S\",$A123>CFF!$A$9),\"\",MAX(V$12:OFFSET(V123,-1,0))+1)","v":""},"SINAPI-89753",4009,{"$f":"IF(Import.Desoneracao=\"sim\",Referencia.Desonerado,Referencia.NaoDesonerado)","v":9.48},{"$f":"ROUND(IF(ISNUMBER(R123),R123,IF(LEFT(R123,3)=\"BDI\",HLOOKUP(R123,DADOS!$T$37:$X$38,2,FALSE),0)),15-11*$X$5)","v":0.26379999999999998}]
["S",0,1,10,0,0,7,0,0,"Serviço","1.10.7.","SINAPI","89785",{"$f":"IF($A124=\"S\",Referencia.Descricao,\"(digite a descrição aqui)\")","v":"JUNÇÃO SIMPLES, PVC, SERIE NORMAL, ESGOTO PREDIAL, DN 50 X 50 MM, JUNTA ELÁSTICA, FORNECIDO E INSTALADO EM RAMAL DE DESCARGA OU RAMAL DE ESGOTO SANITÁRIO. AF_08/2022"},{"$f":"Referencia.Unidade","v":"UN"},{"$f":"OFFSET(PLQ!$E$12,ROW($P124)-ROW(P$12),0)","v":1},26.88,"BDI 1",33.97,33.97,"",{"$f":"IF(OR($A124=0,$A124=\"S\",$A124>CFF!$A$9),\"\",MAX(V$12:OFFSET(V124,-1,0))+1)","v":""},"SINAPI-89785",4036,{"$f":"IF(Import.Desoneracao=\"sim\",Referencia.Desonerado,Referencia.NaoDesonerado)","v":26.88},{"$f":"ROUND(IF(ISNUMBER(R124),R124,IF(LEFT(R124,3)=\"BDI\",HLOOKUP(R124,DADOS!$T$37:$X$38,2,FALSE),0)),15-11*$X$5)","v":0.26379999999999998}]
["S",0,1,10,0,0,8,0,0,"Serviço","1.10.8.","SINAPI","89744",{"$f":"IF($A125=\"S\",Referencia.Descricao,\"(digite a descrição aqui)\")","v":"JOELHO 90 GRAUS, PVC, SERIE NORMAL, ESGOTO PREDIAL, DN 100 MM, JUNTA ELÁSTICA, FORNECIDO E INSTALADO EM RAMAL DE DESCARGA OU RAMAL DE ESGOTO SANITÁRIO. AF_08/2022"},{"$f":"Referencia.Unidade","v":"UN"},{"$f":"OFFSET(PLQ!$E$12,ROW($P125)-ROW(P$12),0)","v":1},27.7,"BDI 1",35.01,35.01,"",{"$f":"IF(OR($A125=0,$A125=\"S\",$A125>CFF!$A$9),\"\",MAX(V$12:OFFSET(V125,-1,0))+1)","v":""},"SINAPI-89744",4002,{"$f":"IF(Import.Desoneracao=\"sim\",Referencia.Desonerado,Referencia.NaoDesonerado)","v":27.7},{"$f":"ROUND(IF(ISNUMBER(R125),R125,IF(LEFT(R125,3)=\"BDI\",HLOOKUP(R125,DADOS!$T$37:$X$38,2,FALSE),0)),15-11*$X$5)","v":0.26379999999999998}]
["S",0,1,10,0,0,9,0,0,"Serviço","1.10.9.","SINAPI","89731",{"$f":"IF($A126=\"S\",Referencia.Descricao,\"(digite a descrição aqui)\")","v":"JOELHO 90 GRAUS, PVC, SERIE NORMAL, ESGOTO PREDIAL, DN 50 MM, JUNTA ELÁSTICA, FORNECIDO E INSTALADO EM RAMAL DE DESCARGA OU RAMAL DE ESGOTO SANITÁRIO. AF_08/2022"},{"$f":"Referencia.Unidade","v":"UN"},{"$f":"OFFSET(PLQ!$E$12,ROW($P126)-ROW(P$12),0)","v":13},14.66,"BDI 1",18.53,240.89,"",{"$f":"IF(OR($A126=0,$A126=\"S\",$A126>CFF!$A$9),\"\",MAX(V$12:OFFSET(V126,-1,0))+1)","v":""},"SINAPI-89731",3989,{"$f":"IF(Import.Desoneracao=\"sim\",Referencia.Desonerado,Referencia.NaoDesonerado)","v":14.66},{"$f":"ROUND(IF(ISNUMBER(R126),R126,IF(LEFT(R126,3)=\"BDI\",HLOOKUP(R126,DADOS!$T$37:$X$38,2,FALSE),0)),15-11*$X$5)","v":0.26379999999999998}]
["S",0,1,10,0,0,10,0,0,"Serviço","1.10.10.","SINAPI","89724",{"$f":"IF($A127=\"S\",Referencia.Descricao,\"(digite a descrição aqui)\")","v":"JOELHO 90 GRAUS, PVC, SERIE NORMAL, ESGOTO PREDIAL, DN 40 MM, JUNTA SOLDÁVEL, FORNECIDO E INSTALADO EM RAMAL DE DESCARGA OU RAMAL DE ESGOTO SANITÁRIO. AF_08/2022"},{"$f":"Referencia.Unidade","v":"UN"},{"$f":"OFFSET(PLQ!$E$12,ROW($P127)-ROW(P$12),0)","v":6},10.199999999999999,"BDI 1",12.89,77.34,"",{"$f":"IF(OR($A127=0,$A127=\"S\",$A127>CFF!$A$9),\"\",MAX(V$12:OFFSET(V127,-1,0))+1)","v":""},"SINAPI-89724",3982,{"$f":"IF(Import.Desoneracao=\"sim\",Referencia.Desonerado,Referencia.NaoDesonerado)","v":10.199999999999999},{"$f":"ROUND(IF(ISNUMBER(R127),R127,IF(LEFT(R127,3)=\"BDI\",HLOOKUP(R127,DADOS!$T$37:$X$38,2,FALSE),0)),15-11*$X$5)","v":0.26379999999999998}]
["S",0,1,10,0,0,11,0,0,"Serviço","1.10.11.","SINAPI","89746",{"$f":"IF($A128=\"S\",Referencia.Descricao,\"(digite a descrição aqui)\")","v":"JOELHO 45 GRAUS, PVC, SERIE NORMAL, ESGOTO PREDIAL, DN 100 MM, JUNTA ELÁSTICA, FORNECIDO E INSTALADO EM RAMAL DE DESCARGA OU RAMAL DE ESGOTO SANITÁRIO. AF_08/2022"},{"$f":"Referencia.Unidade","v":"UN"},{"$f":"OFFSET(PLQ!$E$12,ROW($P128)-ROW(P$12),0)","v":8},28.64,"BDI 1",36.200000000000003,289.60000000000002,"",{"$f":"IF(OR($A128=0,$A128=\"S\",$A128>CFF!$A$9),\"\",MAX(V$12:OFFSET(V128,-1,0))+1)","v":""},"SINAPI-89746",4003,{"$f":"IF(Import.Desoneracao=\"sim\",Referencia.Desonerado,Referencia.NaoDesonerado)","v":28.64},{"$f":"ROUND(IF(ISNUMBER(R128),R128,IF(LEFT(R128,3)=\"BDI\",HLOOKUP(R128,DADOS!$T$37:$X$38,2,FALSE),0)),15-11*$X$5)","v":0.26379999999999998}]
["S",0,1,10,0,0,12,0,0,"Serviço","1.10.12.","SINAPI","89739",{"$f":"IF($A129=\"S\",Referencia.Descricao,\"(digite a descrição aqui)\")","v":"JOELHO 45 GRAUS, PVC, SERIE NORMAL, ESGOTO PREDIAL, DN 75 MM, JUNTA ELÁSTICA, FORNECIDO E INSTALADO EM RAMAL DE DESCARGA OU RAMAL DE ESGOTO SANITÁRIO. AF_08/2022"},{"$f":"Referencia.Unidade","v":"UN"},{"$f":"OFFSET(PLQ!$E$12,ROW($P129)-ROW(P$12),0)","v":3},23.76,"BDI 1",30.03,90.09,"",{"$f":"IF(OR($A129=0,$A129=\"S\",$A129>CFF!$A$9),\"\",MAX(V$12:OFFSET(V129,-1,0))+1)","v":""},"SINAPI-89739",3997,{"$f":"IF(Import.Desoneracao=\"sim\",Referencia.Desonerado,Referencia.NaoDesonerado)","v":23.76},{"$f":"ROUND(IF(ISNUMBER(R129),R129,IF(LEFT(R129,3)=\"BDI\",HLOOKUP(R129,DADOS!$T$37:$X$38,2,FALSE),0)),15-11*$X$5)","v":0.26379999999999998}]
["S",0,1,10,0,0,13,0,0,"Serviço","1.10.13.","SINAPI","89732",{"$f":"IF($A130=\"S\",Referencia.Descricao,\"(digite a descrição aqui)\")","v":"JOELHO 45 GRAUS, PVC, SERIE NORMAL, ESGOTO PREDIAL, DN 50 MM, JUNTA ELÁSTICA, FORNECIDO E INSTALADO EM RAMAL DE DESCARGA OU RAMAL DE ESGOTO SANITÁRIO. AF_08/2022"},{"$f":"Referencia.Unidade","v":"UN"},{"$f":"OFFSET(PLQ!$E$12,ROW($P130)-ROW(P$12),0)","v":2},15.48,"BDI 1",19.559999999999999,39.119999999999997,"",{"$f":"IF(OR($A130=0,$A130=\"S\",$A130>CFF!$A$9),\"\",MAX(V$12:OFFSET(V130,-1,0))+1)","v":""},"SINAPI-89732",3990,{"$f":"IF(Import.Desoneracao=\"sim\",Referencia.Desonerado,Referencia.NaoDesonerado)","v":15.48},{"$f":"ROUND(IF(ISNUMBER(R130),R130,IF(LEFT(R130,3)=\"BDI\",HLOOKUP(R130,DADOS!$T$37:$X$38,2,FALSE),0)),15-11*$X$5)","v":0.26379999999999998}]
["S",0,1,10,0,0,14,0,0,"Serviço","1.10.14.","SINAPI","89726",{"$f":"IF($A131=\"S\",Referencia.Descricao,\"(digite a descrição aqui)\")","v":"JOELHO 45 GRAUS, PVC, SERIE NORMAL, ESGOTO PREDIAL, DN 40 MM, JUNTA SOLDÁVEL, FORNECIDO E INSTALADO EM RAMAL DE DESCARGA OU RAMAL DE ESGOTO SANITÁRIO. AF_08/2022"},{"$f":"Referencia.Unidade","v":"UN"},{"$f":"OFFSET(PLQ!$E$12,ROW($P131)-ROW(P$12),0)","v":1},10.46,"BDI 1",13.22,13.22,"",{"$f":"IF(OR($A131=0,$A131=\"S\",$A131>CFF!$A$9),\"\",MAX(V$12:OFFSET(V131,-1,0))+1)","v":""},"SINAPI-89726",3984,{"$f":"IF(Import.Desoneracao=\"sim\",Referencia.Desonerado,Referencia.NaoDesonerado)","v":10.46},{"$f":"ROUND(IF(ISNUMBER(R131),R131,IF(LEFT(R131,3)=\"BDI\",HLOOKUP(R131,DADOS!$T$37:$X$38,2,FALSE),0)),15-11*$X$5)","v":0.26379999999999998}]
[{"$f":"CHOOSE(1+LOG(1+2*(J132=\"Meta\")+4*(J132=\"Nível 2\")+8*(J132=\"Nível 3\")+16*(J132=\"Nível 4\")+32*(J132=\"Serviço\"),2),0,1,2,3,4,\"S\")","v":"S"},{"$f":"IF(OR(A132=\"S\",A132=0),0,IF(ISERROR(I132),H132,SMALL(H132:I132,1)))","v":0},{"$f":"IF($A132=1,OFFSET(C132,-1,0)+1,OFFSET(C132,-1,0))","v":1},{"$f":"IF($A132=1,0,IF($A132=2,OFFSET(D132,-1,0)+1,OFFSET(D132,-1,0)))","v":10},{"$f":"IF(AND($A132<=2,$A132<>0),0,IF($A132=3,OFFSET(E132,-1,0)+1,OFFSET(E132,-1,0)))","v":0},{"$f":"IF(AND($A132<=3,$A132<>0),0,IF($A132=4,OFFSET(F132,-1,0)+1,OFFSET(F132,-1,0)))","v":0},{"$f":"IF(AND($A132<=4,$A132<>0),0,IF($A132=\"S\",OFFSET(G132,-1,0)+1,OFFSET(G132,-1,0)))","v":15},0,0,"Serviço",{"$f":"IF($A132=0,\"-\",CONCATENATE(C132&\".\",IF(AND($A$5>=2,$A132>=2),D132&\".\",\"\"),IF(AND($A$5>=3,$A132>=3),E132&\".\",\"\"),IF(AND($A$5>=4,$A132>=4),F132&\".\",\"\"),IF($A132=\"S\",G132&\".\",\"\")))","v":"1.10.15."},"SINAPI","89711",{"$f":"IF($A132=\"S\",Referencia.Descricao,\"(digite a descrição aqui)\")","v":"TUBO PVC, SERIE NORMAL, ESGOTO PREDIAL, DN 40 MM, FORNECIDO E INSTALADO EM RAMAL DE DESCARGA OU RAMAL DE ESGOTO SANITÁRIO. AF_08/2022"},{"$f":"Referencia.Unidade","v":"M"},{"$f":"OFFSET(PLQ!$E$12,ROW($P132)-ROW(P$12),0)","v":6},21.11,"BDI 1",{"$f":"IF($A132=\"S\",IF($Q$10=\"Preço Unitário (R$)\",PO.CustoUnitario,ROUND(PO.CustoUnitario*(1+$Z132),15-13*$X$6)),0)","v":26.68},{"$f":"IF($A132=\"S\",VTOTAL1,IF($A132=0,0,ROUND(SomaAgrup,15-13*$X$7)))","v":160.08000000000001},{"$f":"IF($J132=\"\",\"\",IF($N132=\"\",\"DESCRIÇÃO\",IF(AND($J132=\"Serviço\",$O132=\"\"),\"UNIDADE\",IF($T132<=0,\"SEM VALOR\",IF(AND($Y132<>\"\",$Q132>$Y132),\"ACIMA REF.\",\"\")))))","v":""},{"$f":"IF(OR($A132=0,$A132=\"S\",$A132>CFF!$A$9),\"\",MAX(V$12:OFFSET(V132,-1,0))+1)","v":""},{"$f":"IF(AND($J132=\"Serviço\",$M132<>\"\"),IF($L132=\"\",$M132,CONCATENATE($L132,\"-\",$M132)))","v":"SINAPI-89711"},{"$f":"IF(AND(Fonte<>\"\",Código<>\"\"),MATCH(Fonte&\" \"&IF(Fonte=\"sinapi\",SUBSTITUTE(SUBSTITUTE(Código,\"/00\",\"/\"),\"/0\",\"/\"),Código),INDIRECT(\"'[Referência \"&_xlnm.Database&\".xls]Banco'!$a:$a\"),0),\"X\")","v":3471},{"$f":"IF(Import.Desoneracao=\"sim\",Referencia.Desonerado,Referencia.NaoDesonerado)","v":21.11},{"$f":"ROUND(IF(ISNUMBER(R132),R132,IF(LEFT(R132,3)=\"BDI\",HLOOKUP(R132,DADOS!$T$37:$X$38,2,FALSE),0)),15-11*$X$5)","v":0.26379999999999998}]
["S",0,1,10,0,0,16,0,0,"Serviço","1.10.16.","SINAPI","89712",{"$f":"IF($A133=\"S\",Referencia.Descricao,\"(digite a descrição aqui)\")","v":"TUBO PVC, SERIE NORMAL, ESGOTO PREDIAL, DN 50 MM, FORNECIDO E INSTALADO EM RAMAL DE DESCARGA OU RAMAL DE ESGOTO SANITÁRIO. AF_08/2022"},{"$f":"Referencia.Unidade","v":"M"},{"$f":"OFFSET(PLQ!$E$12,ROW($P133)-ROW(P$12),0)","v":6},27.29,"BDI 1",34.49,206.94,"",{"$f":"IF(OR($A133=0,$A133=\"S\",$A133>CFF!$A$9),\"\",MAX(V$12:OFFSET(V133,-1,0))+1)","v":""},"SINAPI-89712",3472,{"$f":"IF(Import.Desoneracao=\"sim\",Referencia.Desonerado,Referencia.NaoDesonerado)","v":27.29},{"$f":"ROUND(IF(ISNUMBER(R133),R133,IF(LEFT(R133,3)=\"BDI\",HLOOKUP(R133,DADOS!$T$37:$X$38,2,FALSE),0)),15-11*$X$5)","v":0.26379999999999998}]
["S",0,1,10,0,0,17,0,0,"Serviço","1.10.17.","SINAPI","89713",{"$f":"IF($A134=\"S\",Referencia.Descricao,\"(digite a descrição aqui)\")","v":"TUBO PVC, SERIE NORMAL, ESGOTO PREDIAL, DN 75 MM, FORNECIDO E INSTALADO EM RAMAL DE DESCARGA OU RAMAL DE ESGOTO SANITÁRIO. AF_08/2022"},{"$f":"Referencia.Unidade","v":"M"},{"$f":"OFFSET(PLQ!$E$12,ROW($P134)-ROW(P$12),0)","v":6},34.159999999999997,"BDI 1",43.17,259.02,"",{"$f":"IF(OR($A134=0,$A134=\"S\",$A134>CFF!$A$9),\"\",MAX(V$12:OFFSET(V134,-1,0))+1)","v":""},"SINAPI-89713",3473,{"$f":"IF(Import.Desoneracao=\"sim\",Referencia.Desonerado,Referencia.NaoDesonerado)","v":34.159999999999997},{"$f":"ROUND(IF(ISNUMBER(R134),R134,IF(LEFT(R134,3)=\"BDI\",HLOOKUP(R134,DADOS!$T$37:$X$38,2,FALSE),0)),15-11*$X$5)","v":0.26379999999999998}]
["S",0,1,10,0,0,18,0,0,"Serviço","1.10.18.","SINAPI","89714",{"$f":"IF($A135=\"S\",Referencia.Descricao,\"(digite a descrição aqui)\")","v":"TUBO PVC, SERIE NORMAL, ESGOTO PREDIAL, DN 100 MM, FORNECIDO E INSTALADO EM RAMAL DE DESCARGA OU RAMAL DE ESGOTO SANITÁRIO. AF_08/2022"},{"$f":"Referencia.Unidade","v":"M"},{"$f":"OFFSET(PLQ!$E$12,ROW($P135)-ROW(P$12),0)","v":15},38,"BDI 1",48.02,720.3,"",{"$f":"IF(OR($A135=0,$A135=\"S\",$A135>CFF!$A$9),\"\",MAX(V$12:OFFSET(V135,-1,0))+1)","v":""},"SINAPI-89714",3474,{"$f":"IF(Import.Desoneracao=\"sim\",Referencia.Desonerado,Referencia.NaoDesonerado)","v":38},{"$f":"ROUND(IF(ISNUMBER(R135),R135,IF(LEFT(R135,3)=\"BDI\",HLOOKUP(R135,DADOS!$T$37:$X$38,2,FALSE),0)),15-11*$X$5)","v":0.26379999999999998}]
["S",0,1,10,0,0,19,0,0,"Serviço","1.10.19.","SINAPI","86931",{"$f":"IF($A136=\"S\",Referencia.Descricao,\"(digite a descrição aqui)\")","v":"VASO SANITÁRIO SIFONADO COM CAIXA ACOPLADA LOUÇA BRANCA, INCLUSO ENGATE FLEXÍVEL EM PLÁSTICO BRANCO, 1/2  X 40CM - FORNECIMENTO E INSTALAÇÃO. AF_01/2020"},{"$f":"Referencia.Unidade","v":"UN"},{"$f":"OFFSET(PLQ!$E$12,ROW($P136)-ROW(P$12),0)","v":1},492.84,"BDI 1",622.85,622.85,"",{"$f":"IF(OR($A136=0,$A136=\"S\",$A136>CFF!$A$9),\"\",MAX(V$12:OFFSET(V136,-1,0))+1)","v":""},"SINAPI-86931",5106,{"$f":"IF(Import.Desoneracao=\"sim\",Referencia.Desonerado,Referencia.NaoDesonerado)","v":492.84},{"$f":"ROUND(IF(ISNUMBER(R136),R136,IF(LEFT(R136,3)=\"BDI\",HLOOKUP(R136,DADOS!$T$37:$X$38,2,FALSE),0)),15-11*$X$5)","v":0.26379999999999998}]
["S",0,1,10,0,0,20,0,0,"Serviço","1.10.20.","SINAPI-I","377",{"$f":"IF($A137=\"S\",Referencia.Descricao,\"(digite a descrição aqui)\")","v":"ASSENTO SANITARIO DE PLASTICO, TIPO CONVENCIONAL"},{"$f":"Referencia.Unidade","v":"UN    "},{"$f":"OFFSET(PLQ!$E$12,ROW($P137)-ROW(P$12),0)","v":1},36.9,"BDI 1",46.63,46.63,"",{"$f":"IF(OR($A137=0,$A137=\"S\",$A137>CFF!$A$9),\"\",MAX(V$12:OFFSET(V137,-1,0))+1)","v":""},"SINAPI-I-377",7884,{"$f":"IF(Import.Desoneracao=\"sim\",Referencia.Desonerado,Referencia.NaoDesonerado)","v":36.9},{"$f":"ROUND(IF(ISNUMBER(R137),R137,IF(LEFT(R137,3)=\"BDI\",HLOOKUP(R137,DADOS!$T$37:$X$38,2,FALSE),0)),15-11*$X$5)","v":0.26379999999999998}]
["S",0,1,10,0,0,21,0,0,"Serviço","1.10.21.","SINAPI","86943",{"$f":"IF($A138=\"S\",Referencia.Descricao,\"(digite a descrição aqui)\")","v":"LAVATÓRIO LOUÇA BRANCA SUSPENSO, 29,5 X 39CM OU EQUIVALENTE, PADRÃO POPULAR, INCLUSO SIFÃO FLEXÍVEL EM PVC, VÁLVULA E ENGATE FLEXÍVEL 30CM EM PLÁSTICO E TORNEIRA CROMADA DE MESA, PADRÃO POPULAR - FORNECIMENTO E INSTALAÇÃO. AF_01/2020"},{"$f":"Referencia.Unidade","v":"UN"},{"$f":"OFFSET(PLQ!$E$12,ROW($P138)-ROW(P$12),0)","v":1},294.74,"BDI 1",372.49,372.49,"",{"$f":"IF(OR($A138=0,$A138=\"S\",$A138>CFF!$A$9),\"\",MAX(V$12:OFFSET(V138,-1,0))+1)","v":""},"SINAPI-86943",5118,{"$f":"IF(Import.Desoneracao=\"sim\",Referencia.Desonerado,Referencia.NaoDesonerado)","v":294.74},{"$f":"ROUND(IF(ISNUMBER(R138),R138,IF(LEFT(R138,3)=\"BDI\",HLOOKUP(R138,DADOS!$T$37:$X$38,2,FALSE),0)),15-11*$X$5)","v":0.26379999999999998}]
["S",0,1,10,0,0,22,0,0,"Serviço","1.10.22.","SINAPI","98110",{"$f":"IF($A139=\"S\",Referencia.Descricao,\"(digite a descrição aqui)\")","v":"CAIXA DE GORDURA PEQUENA (CAPACIDADE: 19 L), CIRCULAR, EM PVC, DIÂMETRO INTERNO= 0,3 M. AF_12/2020"},{"$f":"Referencia.Unidade","v":"UN"},{"$f":"OFFSET(PLQ!$E$12,ROW($P139)-ROW(P$12),0)","v":1},416.75,"BDI 1",526.69000000000005,526.69000000000005,"",{"$f":"IF(OR($A139=0,$A139=\"S\",$A139>CFF!$A$9),\"\",MAX(V$12:OFFSET(V139,-1,0))+1)","v":""},"SINAPI-98110",5208,{"$f":"IF(Import.Desoneracao=\"sim\",Referencia.Desonerado,Referencia.NaoDesonerado)","v":416.75},{"$f":"ROUND(IF(ISNUMBER(R139),R139,IF(LEFT(R139,3)=\"BDI\",HLOOKUP(R139,DADOS!$T$37:$X$38,2,FALSE),0)),15-11*$X$5)","v":0.26379999999999998}]
["S",0,1,10,0,0,23,0,0,"Serviço","1.10.23.","SINAPI","89707",{"$f":"IF($A140=\"S\",Referencia.Descricao,\"(digite a descrição aqui)\")","v":"CAIXA SIFONADA, PVC, DN 100 X 100 X 50 MM, JUNTA ELÁSTICA, FORNECIDA E INSTALADA EM RAMAL DE DESCARGA OU EM RAMAL DE ESGOTO SANITÁRIO. AF_08/2022"},{"$f":"Referencia.Unidade","v":"UN"},{"$f":"OFFSET(PLQ!$E$12,ROW($P140)-ROW(P$12),0)","v":1},49.73,"BDI 1",62.85,62.85,"",{"$f":"IF(OR($A140=0,$A140=\"S\",$A140>CFF!$A$9),\"\",MAX(V$12:OFFSET(V140,-1,0))+1)","v":""},"SINAPI-89707",5050,{"$f":"IF(Import.Desoneracao=\"sim\",Referencia.Desonerado,Referencia.NaoDesonerado)","v":49.73},{"$f":"ROUND(IF(ISNUMBER(R140),R140,IF(LEFT(R140,3)=\"BDI\",HLOOKUP(R140,DADOS!$T$37:$X$38,2,FALSE),0)),15-11*$X$5)","v":0.26379999999999998}]
["S",0,1,10,0,0,24,0,0,"Serviço","1.10.24.","COTAÇÃO","04",{"$f":"IF($A141=\"S\",Referencia.Descricao,\"(digite a descrição aqui)\")","v":"TANQUE SEPTICO CAP-1875 LITROS DE CONCRETO"},{"$f":"Referencia.Unidade","v":"UNIDADE"},{"$f":"OFFSET(PLQ!$E$12,ROW($P141)-ROW(P$12),0)","v":1},800,"BDI 1",1011.04,1011.04,"",{"$f":"IF(OR($A141=0,$A141=\"S\",$A141>CFF!$A$9),\"\",MAX(V$12:OFFSET(V141,-1,0))+1)","v":""},"COTAÇÃO-04",25,{"$f":"IF(Import.Desoneracao=\"sim\",Referencia.Desonerado,Referencia.NaoDesonerado)","v":800},{"$f":"ROUND(IF(ISNUMBER(R141),R141,IF(LEFT(R141,3)=\"BDI\",HLOOKUP(R141,DADOS!$T$37:$X$38,2,FALSE),0)),15-11*$X$5)","v":0.26379999999999998}]
[-1,null,0,0,0,0,0]
[null,null,null,null,null,null,null,null,null,null,"Encargos sociais:",null,"Para elaboração deste orçamento, foram utilizados os encargos sociais do SINAPI para a Unidade da Federação indicada."]
[]
[null,null,null,null,null,null,null,null,null,null,"Observações:"]
[]
[]
[]
[]
[null,null,null,null,null,null,null,null,null,null,{"$f":"IF(AND($X$3=FALSE,$X$4=FALSE,$X$5=FALSE,$X$6=FALSE,$X$7=FALSE),\"Não foi considerado arredondamento nos valores da planilha.\",CONCATENATE(\"Foi considerado arredondamento de duas casas decimais para \",IF($X$3=TRUE,\"Quantidade; \",\"\"),IF($X$4=TRUE,\"Custo Unitário; \",\"\"),IF($X$5=TRUE,\"BDI; \",\"\"),IF($X$6=TRUE,\"Preço Unitário; \",\"\"),IF($X$7=TRUE,\"Preço Total.\",\"\")))","v":"Foi considerado arredondamento de duas casas decimais para Quantidade; Custo Unitário; BDI; Preço Unitário; Preço Total."}]
[]
[]
[null,null,null,null,null,null,null,null,null,null,{"$f":"Import.Município","v":"SÃO JOÃO DA URTIGA/RS"}]
[null,null,null,null,null,null,null,null,null,null,"Local"]
[]
[null,null,null,null,null,null,null,null,null,null,{"$f":"TODAY()","v":"2023-06-06"}]
[null,null,null,null,null,null,null,null,null,null,"Data"]

{"sheet":"PLQ","index":3,"n_rows":148,"n_cols":21,"rows_kept":148,"cut":false,"hidden":false,"merged":[[143,1,143,2],[146,1,146,2]]}
[null,null,null,null,"PLQ -","PLANILHA DE LEVANTAMENTO DE QUANTIDADES"]
[]
[]
[]
[]
[]
[null,null,null,null,{"$f":"OFFSET(PO!$P$12,ROW($E7)-ROW(E$12),0)","v":0}]
[]
[null,null,null,null,"-",1]
["Nível","Item","Descrição","Unid.","Quantidade",{"$f":"IF(OFFSET(F10,0,-1)=\"Quantidade\",1,OFFSET(F10,0,-1)+1)","v":1},2,3,4,5,6,7,8,9,10,null,null,null,null,null,{"$f":"IF(OFFSET(U10,0,-1)=\"Quantidade\",1,OFFSET(U10,0,-1)+1)","v":1}]
[{"$f":"OFFSET(PO!J$12,ROW(A11)-ROW($A$12),0)","v":"Serviço"},{"$f":"IF($A11=0,\"\",OFFSET(PO!K$12,ROW(B11)-ROW(B$12),0))","v":{"$error":"#VALUE!"}},{"$f":"IF(OFFSET(PO!N$12,ROW(C11)-ROW(C$12),0)=0,\"\",OFFSET(PO!N$12,ROW(C11)-ROW(C$12),0))","v":""},{"$f":"IF(OFFSET(PO!O$12,ROW(D11)-ROW(D$12),0)=0,\"\",OFFSET(PO!O$12,ROW(D11)-ROW(D$12),0))","v":""},{"$f":"IF($A11<>\"Serviço\",0,ROUND(SUMIF($F$9:$P$9,\"<>\",$F11:$P11),15-13*PO!$X$3))","v":0}]
[{"$f":"PO!J12","v":"LOTE"},null,{"$f":"PO!N12","v":0}]
[{"$f":"OFFSET(PO!J$12,ROW(A13)-ROW($A$12),0)","v":"Meta"},{"$f":"IF($A13=0,\"\",OFFSET(PO!K$12,ROW(B13)-ROW(B$12),0))","v":"1."},{"$f":"IF(OFFSET(PO!N$12,ROW(C13)-ROW(C$12),0)=0,\"\",OFFSET(PO!N$12,ROW(C13)-ROW(C$12),0))","v":" RESIDÊNCIA POPULAR UNIFAMILIARES EM MADEIRA"},{"$f":"IF(OFFSET(PO!O$12,ROW(D13)-ROW(D$12),0)=0,\"\",OFFSET(PO!O$12,ROW(D13)-ROW(D$12),0))","v":""},{"$f":"IF($A13<>\"Serviço\",0,ROUND(SUMIF($F$9:$P$9,\"<>\",$F13:$P13),15-13*PO!$X$3))","v":0}]
[{"$f":"OFFSET(PO!J$12,ROW(A14)-ROW($A$12),0)","v":"Nível 2"},{"$f":"IF($A14=0,\"\",OFFSET(PO!K$12,ROW(B14)-ROW(B$12),0))","v":"1.1."},{"$f":"IF(OFFSET(PO!N$12,ROW(C14)-ROW(C$12),0)=0,\"\",OFFSET(PO!N$12,ROW(C14)-ROW(C$12),0))","v":"SERVIÇOS PRELIMINARES"},{"$f":"IF(OFFSET(PO!O$12,ROW(D14)-ROW(D$12),0)=0,\"\",OFFSET(PO!O$12,ROW(D14)-ROW(D$12),0))","v":""},{"$f":"IF($A14<>\"Serviço\",0,ROUND(SUMIF($F$9:$P$9,\"<>\",$F14:$P14),15-13*PO!$X$3))","v":0}]
[{"$f":"OFFSET(PO!J$12,ROW(A15)-ROW($A$12),0)","v":"Serviço"},{"$f":"IF($A15=0,\"\",OFFSET(PO!K$12,ROW(B15)-ROW(B$12),0))","v":"1.1.1."},{"$f":"IF(OFFSET(PO!N$12,ROW(C15)-ROW(C$12),0)=0,\"\",OFFSET(PO!N$12,ROW(C15)-ROW(C$12),0))","v":"ENTRADA DE ENERGIA ELÉTRICA, AÉREA, MONOFÁSICA, COM CAIXA DE SOBREPOR, CABO DE 10 MM2 E DISJUNTOR DIN 50A (NÃO INCLUSO O POSTE DE CONCRETO). AF_07/2020_PS"},{"$f":"IF(OFFSET(PO!O$12,ROW(D15)-ROW(D$12),0)=0,\"\",OFFSET(PO!O$12,ROW(D15)-ROW(D$12),0))","v":"UN"},{"$f":"IF($A15<>\"Serviço\",0,ROUND(SUMIF($F$9:$P$9,\"<>\",$F15:$P15),15-13*PO!$X$3))","v":1},1]
[{"$f":"OFFSET(PO!J$12,ROW(A16)-ROW($A$12),0)","v":"Serviço"},{"$f":"IF($A16=0,\"\",OFFSET(PO!K$12,ROW(B16)-ROW(B$12),0))","v":"1.1.2."},{"$f":"IF(OFFSET(PO!N$12,ROW(C16)-ROW(C$12),0)=0,\"\",OFFSET(PO!N$12,ROW(C16)-ROW(C$12),0))","v":"POSTE DE CONCRETO ARMADO DE SECAO CIRCULAR, EXTENSAO DE 10,00 M, RESISTENCIA DE 150 A 200 DAN, TIPO C-14"},{"$f":"IF(OFFSET(PO!O$12,ROW(D16)-ROW(D$12),0)=0,\"\",OFFSET(PO!O$12,ROW(D16)-ROW(D$12),0))","v":"UN    "},{"$f":"IF($A16<>\"Serviço\",0,ROUND(SUMIF($F$9:$P$9,\"<>\",$F16:$P16),15-13*PO!$X$3))","v":1},1]
[{"$f":"OFFSET(PO!J$12,ROW(A17)-ROW($A$12),0)","v":"Nível 2"},{"$f":"IF($A17=0,\"\",OFFSET(PO!K$12,ROW(B17)-ROW(B$12),0))","v":"1.2."},{"$f":"IF(OFFSET(PO!N$12,ROW(C17)-ROW(C$12),0)=0,\"\",OFFSET(PO!N$12,ROW(C17)-ROW(C$12),0))","v":"INFRAESTRUTURA"},{"$f":"IF(OFFSET(PO!O$12,ROW(D17)-ROW(D$12),0)=0,\"\",OFFSET(PO!O$12,ROW(D17)-ROW(D$12),0))","v":""},{"$f":"IF($A17<>\"Serviço\",0,ROUND(SUMIF($F$9:$P$9,\"<>\",$F17:$P17),15-13*PO!$X$3))","v":0}]
[{"$f":"OFFSET(PO!J$12,ROW(A18)-ROW($A$12),0)","v":"Serviço"},{"$f":"IF($A18=0,\"\",OFFSET(PO!K$12,ROW(B18)-ROW(B$12),0))","v":"1.2.1."},{"$f":"IF(OFFSET(PO!N$12,ROW(C18)-ROW(C$12),0)=0,\"\",OFFSET(PO!N$12,ROW(C18)-ROW(C$12),0))","v":"ESCAVAÇÃO MANUAL DE VALA PARA VIGA BALDRAME (INCLUINDO ESCAVAÇÃO PARA COLOCAÇÃO DE FÔRMAS). AF_06/2017"},{"$f":"IF(OFFSET(PO!O$12,ROW(D18)-ROW(D$12),0)=0,\"\",OFFSET(PO!O$12,ROW(D18)-ROW(D$12),0))","v":"M3"},{"$f":"IF($A18<>\"Serviço\",0,ROUND(SUMIF($F$9:$P$9,\"<>\",$F18:$P18),15-13*PO!$X$3))","v":4.45},4.45]
[{"$f":"OFFSET(PO!J$12,ROW(A19)-ROW($A$12),0)","v":"Serviço"},{"$f":"IF($A19=0,\"\",OFFSET(PO!K$12,ROW(B19)-ROW(B$12),0))","v":"1.2.2."},{"$f":"IF(OFFSET(PO!N$12,ROW(C19)-ROW(C$12),0)=0,\"\",OFFSET(PO!N$12,ROW(C19)-ROW(C$12),0))","v":"CONCRETO CICLÓPICO FCK = 15MPA, 30% PEDRA DE MÃO EM VOLUME REAL, INCLUSIVE LANÇAMENTO. AF_05/2021"},{"$f":"IF(OFFSET(PO!O$12,ROW(D19)-ROW(D$12),0)=0,\"\",OFFSET(PO!O$12,ROW(D19)-ROW(D$12),0))","v":"M3"},{"$f":"IF($A19<>\"Serviço\",0,ROUND(SUMIF($F$9:$P$9,\"<>\",$F19:$P19),15-13*PO!$X$3))","v":1.48},1.48]
[{"$f":"OFFSET(PO!J$12,ROW(A20)-ROW($A$12),0)","v":"Serviço"},{"$f":"IF($A20=0,\"\",OFFSET(PO!K$12,ROW(B20)-ROW(B$12),0))","v":"1.2.3."},{"$f":"IF(OFFSET(PO!N$12,ROW(C20)-ROW(C$12),0)=0,\"\",OFFSET(PO!N$12,ROW(C20)-ROW(C$12),0))","v":"ALVENARIA DE VEDAÇÃO DE BLOCOS CERÂMICOS MACIÇOS DE 5X10X20CM (ESPESSURA 10CM) E ARGAMASSA DE ASSENTAMENTO COM PREPARO EM BETONEIRA. AF_05/2020"},{"$f":"IF(OFFSET(PO!O$12,ROW(D20)-ROW(D$12),0)=0,\"\",OFFSET(PO!O$12,ROW(D20)-ROW(D$12),0))","v":"M2"},{"$f":"IF($A20<>\"Serviço\",0,ROUND(SUMIF($F$9:$P$9,\"<>\",$F20:$P20),15-13*PO!$X$3))","v":10.18},10.18]
[{"$f":"OFFSET(PO!J$12,ROW(A21)-ROW($A$12),0)","v":"Serviço"},{"$f":"IF($A21=0,\"\",OFFSET(PO!K$12,ROW(B21)-ROW(B$12),0))","v":"1.2.4."},{"$f":"IF(OFFSET(PO!N$12,ROW(C21)-ROW(C$12),0)=0,\"\",OFFSET(PO!N$12,ROW(C21)-ROW(C$12),0))","v":"FABRICAÇÃO, MONTAGEM E DESMONTAGEM DE FÔRMA PARA VIGA BALDRAME, EM MADEIRA SERRADA, E=25 MM, 2 UTILIZAÇÕES. AF_06/2017"},{"$f":"IF(OFFSET(PO!O$12,ROW(D21)-ROW(D$12),0)=0,\"\",OFFSET(PO!O$12,ROW(D21)-ROW(D$12),0))","v":"M2"},{"$f":"IF($A21<>\"Serviço\",0,ROUND(SUMIF($F$9:$P$9,\"<>\",$F21:$P21),15-13*PO!$X$3))","v":14.82},14.82]
[{"$f":"OFFSET(PO!J$12,ROW(A22)-ROW($A$12),0)","v":"Serviço"},{"$f":"IF($A22=0,\"\",OFFSET(PO!K$12,ROW(B22)-ROW(B$12),0))","v":"1.2.5."},{"$f":"IF(OFFSET(PO!N$12,ROW(C22)-ROW(C$12),0)=0,\"\",OFFSET(PO!N$12,ROW(C22)-ROW(C$12),0))","v":"CONCRETO FCK = 25MPA, TRAÇO 1:2,3:2,7 (EM MASSA SECA DE CIMENTO/ AREIA MÉDIA/ BRITA 1) - PREPARO MECÂNICO COM BETONEIRA 400 L. AF_05/2021"},{"$f":"IF(OFFSET(PO!O$12,ROW(D22)-ROW(D$12),0)=0,\"\",OFFSET(PO!O$12,ROW(D22)-ROW(D$12),0))","v":"M3"},{"$f":"IF($A22<>\"Serviço\",0,ROUND(SUMIF($F$9:$P$9,\"<>\",$F22:$P22),15-13*PO!$X$3))","v":2.96},2.96]
[{"$f":"OFFSET(PO!J$12,ROW(A23)-ROW($A$12),0)","v":"Serviço"},{"$f":"IF($A23=0,\"\",OFFSET(PO!K$12,ROW(B23)-ROW(B$12),0))","v":"1.2.6."},{"$f":"IF(OFFSET(PO!N$12,ROW(C23)-ROW(C$12),0)=0,\"\",OFFSET(PO!N$12,ROW(C23)-ROW(C$12),0))","v":"LANÇAMENTO COM USO DE BALDES, ADENSAMENTO E ACABAMENTO DE CONCRETO EM ESTRUTURAS. AF_02/2022"},{"$f":"IF(OFFSET(PO!O$12,ROW(D23)-ROW(D$12),0)=0,\"\",OFFSET(PO!O$12,ROW(D23)-ROW(D$12),0))","v":"M3"},{"$f":"IF($A23<>\"Serviço\",0,ROUND(SUMIF($F$9:$P$9,\"<>\",$F23:$P23),15-13*PO!$X$3))","v":2.96},2.96]
[{"$f":"OFFSET(PO!J$12,ROW(A24)-ROW($A$12),0)","v":"Serviço"},{"$f":"IF($A24=0,\"\",OFFSET(PO!K$12,ROW(B24)-ROW(B$12),0))","v":"1.2.7."},{"$f":"IF(OFFSET(PO!N$12,ROW(C24)-ROW(C$12),0)=0,\"\",OFFSET(PO!N$12,ROW(C24)-ROW(C$12),0))","v":"ARMAÇÃO DE ESTRUTURAS DIVERSAS DE CONCRETO ARMADO, EXCETO VIGAS, PILARES, LAJES E FUNDAÇÕES, UTILIZANDO AÇO CA-50 DE 10,0 MM - MONTAGEM. AF_06/2022"},{"$f":"IF(OFFSET(PO!O$12,ROW(D24)-ROW(D$12),0)=0,\"\",OFFSET(PO!O$12,ROW(D24)-ROW(D$12),0))","v":"KG"},{"$f":"IF($A24<>\"Serviço\",0,ROUND(SUMIF($F$9:$P$9,\"<>\",$F24:$P24),15-13*PO!$X$3))","v":37.380000000000003},37.380000000000003]
[{"$f":"OFFSET(PO!J$12,ROW(A25)-ROW($A$12),0)","v":"Serviço"},{"$f":"IF($A25=0,\"\",OFFSET(PO!K$12,ROW(B25)-ROW(B$12),0))","v":"1.2.8."},{"$f":"IF(OFFSET(PO!N$12,ROW(C25)-ROW(C$12),0)=0,\"\",OFFSET(PO!N$12,ROW(C25)-ROW(C$12),0))","v":"ARMAÇÃO DE ESTRUTURAS DIVERSAS DE CONCRETO ARMADO, EXCETO VIGAS, PILARES, LAJES E FUNDAÇÕES, UTILIZANDO AÇO CA-50 DE 8,0 MM - MONTAGEM. AF_06/2022"},{"$f":"IF(OFFSET(PO!O$12,ROW(D25)-ROW(D$12),0)=0,\"\",OFFSET(PO!O$12,ROW(D25)-ROW(D$12),0))","v":"KG"},{"$f":"IF($A25<>\"Serviço\",0,ROUND(SUMIF($F$9:$P$9,\"<>\",$F25:$P25),15-13*PO!$X$3))","v":9.76},9.76]
[{"$f":"OFFSET(PO!J$12,ROW(A26)-ROW($A$12),0)","v":"Serviço"},{"$f":"IF($A26=0,\"\",OFFSET(PO!K$12,ROW(B26)-ROW(B$12),0))","v":"1.2.9."},{"$f":"IF(OFFSET(PO!N$12,ROW(C26)-ROW(C$12),0)=0,\"\",OFFSET(PO!N$12,ROW(C26)-ROW(C$12),0))","v":"ARMAÇÃO DE ESTRUTURAS DIVERSAS DE CONCRETO ARMADO, EXCETO VIGAS, PILARES, LAJES E FUNDAÇÕES, UTILIZANDO AÇO CA-60 DE 5,0 MM - MONTAGEM. AF_06/2022"},{"$f":"IF(OFFSET(PO!O$12,ROW(D26)-ROW(D$12),0)=0,\"\",OFFSET(PO!O$12,ROW(D26)-ROW(D$12),0))","v":"KG"},{"$f":"IF($A26<>\"Serviço\",0,ROUND(SUMIF($F$9:$P$9,\"<>\",$F26:$P26),15-13*PO!$X$3))","v":10.39},10.39]
[{"$f":"OFFSET(PO!J$12,ROW(A27)-ROW($A$12),0)","v":"Serviço"},{"$f":"IF($A27=0,\"\",OFFSET(PO!K$12,ROW(B27)-ROW(B$12),0))","v":"1.2.10."},{"$f":"IF(OFFSET(PO!N$12,ROW(C27)-ROW(C$12),0)=0,\"\",OFFSET(PO!N$12,ROW(C27)-ROW(C$12),0))","v":"IMPERMEABILIZAÇÃO DE SUPERFÍCIE COM EMULSÃO ASFÁLTICA, 2 DEMÃOS AF_06/2018"},{"$f":"IF(OFFSET(PO!O$12,ROW(D27)-ROW(D$12),0)=0,\"\",OFFSET(PO!O$12,ROW(D27)-ROW(D$12),0))","v":"M2"},{"$f":"IF($A27<>\"Serviço\",0,ROUND(SUMIF($F$9:$P$9,\"<>\",$F27:$P27),15-13*PO!$X$3))","v":39.520000000000003},39.520000000000003]
[{"$f":"OFFSET(PO!J$12,ROW(A28)-ROW($A$12),0)","v":"Nível 2"},{"$f":"IF($A28=0,\"\",OFFSET(PO!K$12,ROW(B28)-ROW(B$12),0))","v":"1.3."},{"$f":"IF(OFFSET(PO!N$12,ROW(C28)-ROW(C$12),0)=0,\"\",OFFSET(PO!N$12,ROW(C28)-ROW(C$12),0))","v":"SUPRAESTRUTURA"},{"$f":"IF(OFFSET(PO!O$12,ROW(D28)-ROW(D$12),0)=0,\"\",OFFSET(PO!O$12,ROW(D28)-ROW(D$12),0))","v":""},{"$f":"IF($A28<>\"Serviço\",0,ROUND(SUMIF($F$9:$P$9,\"<>\",$F28:$P28),15-13*PO!$X$3))","v":0}]
[{"$f":"OFFSET(PO!J$12,ROW(A29)-ROW($A$12),0)","v":"Serviço"},{"$f":"IF($A29=0,\"\",OFFSET(PO!K$12,ROW(B29)-ROW(B$12),0))","v":"1.3.1."},{"$f":"IF(OFFSET(PO!N$12,ROW(C29)-ROW(C$12),0)=0,\"\",OFFSET(PO!N$12,ROW(C29)-ROW(C$12),0))","v":"CONCRETO FCK = 25MPA, TRAÇO 1:2,3:2,7 (EM MASSA SECA DE CIMENTO/ AREIA MÉDIA/ BRITA 1) - PREPARO MECÂNICO COM BETONEIRA 400 L. AF_05/2021"},{"$f":"IF(OFFSET(PO!O$12,ROW(D29)-ROW(D$12),0)=0,\"\",OFFSET(PO!O$12,ROW(D29)-ROW(D$12),0))","v":"M3"},{"$f":"IF($A29<>\"Serviço\",0,ROUND(SUMIF($F$9:$P$9,\"<>\",$F29:$P29),15-13*PO!$X$3))","v":1.49},1.49]
[{"$f":"OFFSET(PO!J$12,ROW(A30)-ROW($A$12),0)","v":"Serviço"},{"$f":"IF($A30=0,\"\",OFFSET(PO!K$12,ROW(B30)-ROW(B$12),0))","v":"1.3.2."},{"$f":"IF(OFFSET(PO!N$12,ROW(C30)-ROW(C$12),0)=0,\"\",OFFSET(PO!N$12,ROW(C30)-ROW(C$12),0))","v":"LANÇAMENTO COM USO DE BALDES, ADENSAMENTO E ACABAMENTO DE CONCRETO EM ESTRUTURAS. AF_02/2022"},{"$f":"IF(OFFSET(PO!O$12,ROW(D30)-ROW(D$12),0)=0,\"\",OFFSET(PO!O$12,ROW(D30)-ROW(D$12),0))","v":"M3"},{"$f":"IF($A30<>\"Serviço\",0,ROUND(SUMIF($F$9:$P$9,\"<>\",$F30:$P30),15-13*PO!$X$3))","v":1.49},1.49]
[{"$f":"OFFSET(PO!J$12,ROW(A31)-ROW($A$12),0)","v":"Serviço"},{"$f":"IF($A31=0,\"\",OFFSET(PO!K$12,ROW(B31)-ROW(B$12),0))","v":"1.3.3."},{"$f":"IF(OFFSET(PO!N$12,ROW(C31)-ROW(C$12),0)=0,\"\",OFFSET(PO!N$12,ROW(C31)-ROW(C$12),0))","v":"FABRICAÇÃO, MONTAGEM E DESMONTAGEM DE FÔRMA PARA VIGA BALDRAME, EM MADEIRA SERRADA, E=25 MM, 2 UTILIZAÇÕES. AF_06/2017"},{"$f":"IF(OFFSET(PO!O$12,ROW(D31)-ROW(D$12),0)=0,\"\",OFFSET(PO!O$12,ROW(D31)-ROW(D$12),0))","v":"M2"},{"$f":"IF($A31<>\"Serviço\",0,ROUND(SUMIF($F$9:$P$9,\"<>\",$F31:$P31),15-13*PO!$X$3))","v":12.95},12.95]
[{"$f":"OFFSET(PO!J$12,ROW(A32)-ROW($A$12),0)","v":"Serviço"},{"$f":"IF($A32=0,\"\",OFFSET(PO!K$12,ROW(B32)-ROW(B$12),0))","v":"1.3.4."},{"$f":"IF(OFFSET(PO!N$12,ROW(C32)-ROW(C$12),0)=0,\"\",OFFSET(PO!N$12,ROW(C32)-ROW(C$12),0))","v":"ARMAÇÃO DE ESTRUTURAS DIVERSAS DE CONCRETO ARMADO, EXCETO VIGAS, PILARES, LAJES E FUNDAÇÕES, UTILIZANDO AÇO CA-50 DE 10,0 MM - MONTAGEM. AF_06/2022"},{"$f":"IF(OFFSET(PO!O$12,ROW(D32)-ROW(D$12),0)=0,\"\",OFFSET(PO!O$12,ROW(D32)-ROW(D$12),0))","v":"KG"},{"$f":"IF($A32<>\"Serviço\",0,ROUND(SUMIF($F$9:$P$9,\"<>\",$F32:$P32),15-13*PO!$X$3))","v":4.97},4.97]
[{"$f":"OFFSET(PO!J$12,ROW(A33)-ROW($A$12),0)","v":"Serviço"},{"$f":"IF($A33=0,\"\",OFFSET(PO!K$12,ROW(B33)-ROW(B$12),0))","v":"1.3.5."},{"$f":"IF(OFFSET(PO!N$12,ROW(C33)-ROW(C$12),0)=0,\"\",OFFSET(PO!N$12,ROW(C33)-ROW(C$12),0))","v":"ARMAÇÃO DE ESTRUTURAS DIVERSAS DE CONCRETO ARMADO, EXCETO VIGAS, PILARES, LAJES E FUNDAÇÕES, UTILIZANDO AÇO CA-50 DE 8,0 MM - MONTAGEM. AF_06/2022"},{"$f":"IF(OFFSET(PO!O$12,ROW(D33)-ROW(D$12),0)=0,\"\",OFFSET(PO!O$12,ROW(D33)-ROW(D$12),0))","v":"KG"},{"$f":"IF($A33<>\"Serviço\",0,ROUND(SUMIF($F$9:$P$9,\"<>\",$F33:$P33),15-13*PO!$X$3))","v":4.9400000000000004},4.9400000000000004]
[{"$f":"OFFSET(PO!J$12,ROW(A34)-ROW($A$12),0)","v":"Serviço"},{"$f":"IF($A34=0,\"\",OFFSET(PO!K$12,ROW(B34)-ROW(B$12),0))","v":"1.3.6."},{"$f":"IF(OFFSET(PO!N$12,ROW(C34)-ROW(C$12),0)=0,\"\",OFFSET(PO!N$12,ROW(C34)-ROW(C$12),0))","v":"ARMAÇÃO DE ESTRUTURAS DIVERSAS DE CONCRETO ARMADO, EXCETO VIGAS, PILARES, LAJES E FUNDAÇÕES, UTILIZANDO AÇO CA-60 DE 5,0 MM - MONTAGEM. AF_06/2022"},{"$f":"IF(OFFSET(PO!O$12,ROW(D34)-ROW(D$12),0)=0,\"\",OFFSET(PO!O$12,ROW(D34)-ROW(D$12),0))","v":"KG"},{"$f":"IF($A34<>\"Serviço\",0,ROUND(SUMIF($F$9:$P$9,\"<>\",$F34:$P34),15-13*PO!$X$3))","v":9.4700000000000006},9.4700000000000006]
[{"$f":"OFFSET(PO!J$12,ROW(A35)-ROW($A$12),0)","v":"Serviço"},{"$f":"IF($A35=0,\"\",OFFSET(PO!K$12,ROW(B35)-ROW(B$12),0))","v":"1.3.7."},{"$f":"IF(OFFSET(PO!N$12,ROW(C35)-ROW(C$12),0)=0,\"\",OFFSET(PO!N$12,ROW(C35)-ROW(C$12),0))","v":"VERGA MOLDADA IN LOCO EM CONCRETO PARA PORTAS COM ATÉ 1,5 M DE VÃO. AF_03/2016"},{"$f":"IF(OFFSET(PO!O$12,ROW(D35)-ROW(D$12),0)=0,\"\",OFFSET(PO!O$12,ROW(D35)-ROW(D$12),0))","v":"M"},{"$f":"IF($A35<>\"Serviço\",0,ROUND(SUMIF($F$9:$P$9,\"<>\",$F35:$P35),15-13*PO!$X$3))","v":2},2]
[{"$f":"OFFSET(PO!J$12,ROW(A36)-ROW($A$12),0)","v":"Serviço"},{"$f":"IF($A36=0,\"\",OFFSET(PO!K$12,ROW(B36)-ROW(B$12),0))","v":"1.3.8."},{"$f":"IF(OFFSET(PO!N$12,ROW(C36)-ROW(C$12),0)=0,\"\",OFFSET(PO!N$12,ROW(C36)-ROW(C$12),0))","v":"VERGA MOLDADA IN LOCO EM CONCRETO PARA JANELAS COM ATÉ 1,5 M DE VÃO. AF_03/2016"},{"$f":"IF(OFFSET(PO!O$12,ROW(D36)-ROW(D$12),0)=0,\"\",OFFSET(PO!O$12,ROW(D36)-ROW(D$12),0))","v":"M"},{"$f":"IF($A36<>\"Serviço\",0,ROUND(SUMIF($F$9:$P$9,\"<>\",$F36:$P36),15-13*PO!$X$3))","v":2.5},2.5]
[{"$f":"OFFSET(PO!J$12,ROW(A37)-ROW($A$12),0)","v":"Serviço"},{"$f":"IF($A37=0,\"\",OFFSET(PO!K$12,ROW(B37)-ROW(B$12),0))","v":"1.3.9."},{"$f":"IF(OFFSET(PO!N$12,ROW(C37)-ROW(C$12),0)=0,\"\",OFFSET(PO!N$12,ROW(C37)-ROW(C$12),0))","v":"CONTRAVERGA MOLDADA IN LOCO EM CONCRETO PARA VÃOS DE ATÉ 1,5 M DE COMPRIMENTO. AF_03/2016"},{"$f":"IF(OFFSET(PO!O$12,ROW(D37)-ROW(D$12),0)=0,\"\",OFFSET(PO!O$12,ROW(D37)-ROW(D$12),0))","v":"M"},{"$f":"IF($A37<>\"Serviço\",0,ROUND(SUMIF($F$9:$P$9,\"<>\",$F37:$P37),15-13*PO!$X$3))","v":2.5},2.5]
[{"$f":"OFFSET(PO!J$12,ROW(A38)-ROW($A$12),0)","v":"Serviço"},{"$f":"IF($A38=0,\"\",OFFSET(PO!K$12,ROW(B38)-ROW(B$12),0))","v":"1.3.10."},{"$f":"IF(OFFSET(PO!N$12,ROW(C38)-ROW(C$12),0)=0,\"\",OFFSET(PO!N$12,ROW(C38)-ROW(C$12),0))","v":"CAIBRO 5X7cm  EM MADEIRA DE PINHO BRASILEIRO"},{"$f":"IF(OFFSET(PO!O$12,ROW(D38)-ROW(D$12),0)=0,\"\",OFFSET(PO!O$12,ROW(D38)-ROW(D$12),0))","v":"m"},{"$f":"IF($A38<>\"Serviço\",0,ROUND(SUMIF($F$9:$P$9,\"<>\",$F38:$P38),15-13*PO!$X$3))","v":186.05},{"$f":"130.05+56","v":186.05}]
[{"$f":"OFFSET(PO!J$12,ROW(A39)-ROW($A$12),0)","v":"Nível 2"},{"$f":"IF($A39=0,\"\",OFFSET(PO!K$12,ROW(B39)-ROW(B$12),0))","v":"1.4."},{"$f":"IF(OFFSET(PO!N$12,ROW(C39)-ROW(C$12),0)=0,\"\",OFFSET(PO!N$12,ROW(C39)-ROW(C$12),0))","v":"PAREDE"},{"$f":"IF(OFFSET(PO!O$12,ROW(D39)-ROW(D$12),0)=0,\"\",OFFSET(PO!O$12,ROW(D39)-ROW(D$12),0))","v":""},{"$f":"IF($A39<>\"Serviço\",0,ROUND(SUMIF($F$9:$P$9,\"<>\",$F39:$P39),15-13*PO!$X$3))","v":0}]
[{"$f":"OFFSET(PO!J$12,ROW(A40)-ROW($A$12),0)","v":"Serviço"},{"$f":"IF($A40=0,\"\",OFFSET(PO!K$12,ROW(B40)-ROW(B$12),0))","v":"1.4.1."},{"$f":"IF(OFFSET(PO!N$12,ROW(C40)-ROW(C$12),0)=0,\"\",OFFSET(PO!N$12,ROW(C40)-ROW(C$12),0))","v":"ALVENARIA DE VEDAÇÃO DE BLOCOS CERÂMICOS FURADOS NA HORIZONTAL DE 11,5X19X19 CM (ESPESSURA 11,5 CM) E ARGAMASSA DE ASSENTAMENTO COM PREPARO EM BETONEIRA. AF_12/2021"},{"$f":"IF(OFFSET(PO!O$12,ROW(D40)-ROW(D$12),0)=0,\"\",OFFSET(PO!O$12,ROW(D40)-ROW(D$12),0))","v":"M2"},{"$f":"IF($A40<>\"Serviço\",0,ROUND(SUMIF($F$9:$P$9,\"<>\",$F40:$P40),15-13*PO!$X$3))","v":32.159999999999997},32.159999999999997]
[{"$f":"OFFSET(PO!J$12,ROW(A41)-ROW($A$12),0)","v":"Serviço"},{"$f":"IF($A41=0,\"\",OFFSET(PO!K$12,ROW(B41)-ROW(B$12),0))","v":"1.4.2."},{"$f":"IF(OFFSET(PO!N$12,ROW(C41)-ROW(C$12),0)=0,\"\",OFFSET(PO!N$12,ROW(C41)-ROW(C$12),0))","v":"PAREDE DE EUCALIPTO"},{"$f":"IF(OFFSET(PO!O$12,ROW(D41)-ROW(D$12),0)=0,\"\",OFFSET(PO!O$12,ROW(D41)-ROW(D$12),0))","v":"m2"},{"$f":"IF($A41<>\"Serviço\",0,ROUND(SUMIF($F$9:$P$9,\"<>\",$F41:$P41),15-13*PO!$X$3))","v":40.380000000000003},40.380000000000003]
[{"$f":"OFFSET(PO!J$12,ROW(A42)-ROW($A$12),0)","v":"Serviço"},{"$f":"IF($A42=0,\"\",OFFSET(PO!K$12,ROW(B42)-ROW(B$12),0))","v":"1.4.3."},{"$f":"IF(OFFSET(PO!N$12,ROW(C42)-ROW(C$12),0)=0,\"\",OFFSET(PO!N$12,ROW(C42)-ROW(C$12),0))","v":"FORRO DE PINUS"},{"$f":"IF(OFFSET(PO!O$12,ROW(D42)-ROW(D$12),0)=0,\"\",OFFSET(PO!O$12,ROW(D42)-ROW(D$12),0))","v":"m2"},{"$f":"IF($A42<>\"Serviço\",0,ROUND(SUMIF($F$9:$P$9,\"<>\",$F42:$P42),15-13*PO!$X$3))","v":63.54},63.54]
[{"$f":"OFFSET(PO!J$12,ROW(A43)-ROW($A$12),0)","v":"Serviço"},{"$f":"IF($A43=0,\"\",OFFSET(PO!K$12,ROW(B43)-ROW(B$12),0))","v":"1.4.4."},{"$f":"IF(OFFSET(PO!N$12,ROW(C43)-ROW(C$12),0)=0,\"\",OFFSET(PO!N$12,ROW(C43)-ROW(C$12),0))","v":"KIT DE PORTA DE MADEIRA PARA PINTURA, SEMI-OCA (LEVE OU MÉDIA), PADRÃO POPULAR, 80X210CM, ESPESSURA DE 3,5CM, ITENS INCLUSOS: DOBRADIÇAS, MONTAGEM E INSTALAÇÃO DO BATENTE, SEM FECHADURA - FORNECIMENTO E INSTALAÇÃO. AF_12/2019"},{"$f":"IF(OFFSET(PO!O$12,ROW(D43)-ROW(D$12),0)=0,\"\",OFFSET(PO!O$12,ROW(D43)-ROW(D$12),0))","v":"UN"},{"$f":"IF($A43<>\"Serviço\",0,ROUND(SUMIF($F$9:$P$9,\"<>\",$F43:$P43),15-13*PO!$X$3))","v":3},3]
[{"$f":"OFFSET(PO!J$12,ROW(A44)-ROW($A$12),0)","v":"Serviço"},{"$f":"IF($A44=0,\"\",OFFSET(PO!K$12,ROW(B44)-ROW(B$12),0))","v":"1.4.5."},{"$f":"IF(OFFSET(PO!N$12,ROW(C44)-ROW(C$12),0)=0,\"\",OFFSET(PO!N$12,ROW(C44)-ROW(C$12),0))","v":"KIT DE PORTA DE MADEIRA PARA PINTURA, SEMI-OCA (LEVE OU MÉDIA), PADRÃO POPULAR, 80X210CM, ESPESSURA DE 3,5CM, ITENS INCLUSOS: DOBRADIÇAS, MONTAGEM E INSTALAÇÃO DO BATENTE, SEM FECHADURA - FORNECIMENTO E INSTALAÇÃO. AF_12/2019"},{"$f":"IF(OFFSET(PO!O$12,ROW(D44)-ROW(D$12),0)=0,\"\",OFFSET(PO!O$12,ROW(D44)-ROW(D$12),0))","v":"UN"},{"$f":"IF($A44<>\"Serviço\",0,ROUND(SUMIF($F$9:$P$9,\"<>\",$F44:$P44),15-13*PO!$X$3))","v":1},1]
[{"$f":"OFFSET(PO!J$12,ROW(A45)-ROW($A$12),0)","v":"Serviço"},{"$f":"IF($A45=0,\"\",OFFSET(PO!K$12,ROW(B45)-ROW(B$12),0))","v":"1.4.6."},{"$f":"IF(OFFSET(PO!N$12,ROW(C45)-ROW(C$12),0)=0,\"\",OFFSET(PO!N$12,ROW(C45)-ROW(C$12),0))","v":"KIT DE PORTA DE MADEIRA PARA PINTURA, SEMI-OCA (LEVE OU MÉDIA), PADRÃO POPULAR, 90X210CM, ESPESSURA DE 3,5CM, ITENS INCLUSOS: DOBRADIÇAS, MONTAGEM E INSTALAÇÃO DO BATENTE, SEM FECHADURA - FORNECIMENTO E INSTALAÇÃO. AF_12/2019"},{"$f":"IF(OFFSET(PO!O$12,ROW(D45)-ROW(D$12),0)=0,\"\",OFFSET(PO!O$12,ROW(D45)-ROW(D$12),0))","v":"UN"},{"$f":"IF($A45<>\"Serviço\",0,ROUND(SUMIF($F$9:$P$9,\"<>\",$F45:$P45),15-13*PO!$X$3))","v":1},1]
[{"$f":"OFFSET(PO!J$12,ROW(A46)-ROW($A$12),0)","v":"Serviço"},{"$f":"IF($A46=0,\"\",OFFSET(PO!K$12,ROW(B46)-ROW(B$12),0))","v":"1.4.7."},{"$f":"IF(OFFSET(PO!N$12,ROW(C46)-ROW(C$12),0)=0,\"\",OFFSET(PO!N$12,ROW(C46)-ROW(C$12),0))","v":"JANELA DE MADEIRA (PINUS/EUCALIPTO OU EQUIV.) TIPO BASCULANTE COM 2 FOLHAS PARA VIDRO, COM BATENTE, ALIZAR E FERRAGENS. EXCLUSIVE VIDROS, ACABAMENTO E CONTRAMARCO. FORNECIMENTO E INSTALAÇÃO. AF_12/2019"},{"$f":"IF(OFFSET(PO!O$12,ROW(D46)-ROW(D$12),0)=0,\"\",OFFSET(PO!O$12,ROW(D46)-ROW(D$12),0))","v":"M2"},{"$f":"IF($A46<>\"Serviço\",0,ROUND(SUMIF($F$9:$P$9,\"<>\",$F46:$P46),15-13*PO!$X$3))","v":0.25},{"$f":"0.5*0.5","v":0.25}]
[{"$f":"OFFSET(PO!J$12,ROW(A47)-ROW($A$12),0)","v":"Serviço"},{"$f":"IF($A47=0,\"\",OFFSET(PO!K$12,ROW(B47)-ROW(B$12),0))","v":"1.4.8."},{"$f":"IF(OFFSET(PO!N$12,ROW(C47)-ROW(C$12),0)=0,\"\",OFFSET(PO!N$12,ROW(C47)-ROW(C$12),0))","v":"INSTALAÇÃO DE VIDRO LISO, E = 4 MM, EM ESQUADRIA DE MADEIRA, FIXADO COM BAGUETE. AF_01/2021"},{"$f":"IF(OFFSET(PO!O$12,ROW(D47)-ROW(D$12),0)=0,\"\",OFFSET(PO!O$12,ROW(D47)-ROW(D$12),0))","v":"M2"},{"$f":"IF($A47<>\"Serviço\",0,ROUND(SUMIF($F$9:$P$9,\"<>\",$F47:$P47),15-13*PO!$X$3))","v":0.21},{"$f":"0.25*0.85","v":0.21249999999999999}]
[{"$f":"OFFSET(PO!J$12,ROW(A48)-ROW($A$12),0)","v":"Serviço"},{"$f":"IF($A48=0,\"\",OFFSET(PO!K$12,ROW(B48)-ROW(B$12),0))","v":"1.4.9."},{"$f":"IF(OFFSET(PO!N$12,ROW(C48)-ROW(C$12),0)=0,\"\",OFFSET(PO!N$12,ROW(C48)-ROW(C$12),0))","v":"JANELA DE MADEIRA (PINUS/EUCALIPTO OU EQUIV.) DE ABRIR COM 4 FOLHAS (2 VENEZIANAS E 2 GUILHOTINAS PARA VIDRO), COM BATENTE, ALIZAR E FERRAGENS. EXCLUSIVE VIDROS, ACABAMENTO E CONTRAMARCO. FORNECIMENTO E INSTALAÇÃO. AF_12/2019"},{"$f":"IF(OFFSET(PO!O$12,ROW(D48)-ROW(D$12),0)=0,\"\",OFFSET(PO!O$12,ROW(D48)-ROW(D$12),0))","v":"M2"},{"$f":"IF($A48<>\"Serviço\",0,ROUND(SUMIF($F$9:$P$9,\"<>\",$F48:$P48),15-13*PO!$X$3))","v":6.6},6.6]
[{"$f":"OFFSET(PO!J$12,ROW(A49)-ROW($A$12),0)","v":"Serviço"},{"$f":"IF($A49=0,\"\",OFFSET(PO!K$12,ROW(B49)-ROW(B$12),0))","v":"1.4.10."},{"$f":"IF(OFFSET(PO!N$12,ROW(C49)-ROW(C$12),0)=0,\"\",OFFSET(PO!N$12,ROW(C49)-ROW(C$12),0))","v":"INSTALAÇÃO DE VIDRO LISO, E = 4 MM, EM ESQUADRIA DE MADEIRA, FIXADO COM BAGUETE. AF_01/2021"},{"$f":"IF(OFFSET(PO!O$12,ROW(D49)-ROW(D$12),0)=0,\"\",OFFSET(PO!O$12,ROW(D49)-ROW(D$12),0))","v":"M2"},{"$f":"IF($A49<>\"Serviço\",0,ROUND(SUMIF($F$9:$P$9,\"<>\",$F49:$P49),15-13*PO!$X$3))","v":5.61},5.61]
[{"$f":"OFFSET(PO!J$12,ROW(A50)-ROW($A$12),0)","v":"Nível 2"},{"$f":"IF($A50=0,\"\",OFFSET(PO!K$12,ROW(B50)-ROW(B$12),0))","v":"1.5."},{"$f":"IF(OFFSET(PO!N$12,ROW(C50)-ROW(C$12),0)=0,\"\",OFFSET(PO!N$12,ROW(C50)-ROW(C$12),0))","v":"REVESTIMENTOS"},{"$f":"IF(OFFSET(PO!O$12,ROW(D50)-ROW(D$12),0)=0,\"\",OFFSET(PO!O$12,ROW(D50)-ROW(D$12),0))","v":""},{"$f":"IF($A50<>\"Serviço\",0,ROUND(SUMIF($F$9:$P$9,\"<>\",$F50:$P50),15-13*PO!$X$3))","v":0}]
[{"$f":"OFFSET(PO!J$12,ROW(A51)-ROW($A$12),0)","v":"Serviço"},{"$f":"IF($A51=0,\"\",OFFSET(PO!K$12,ROW(B51)-ROW(B$12),0))","v":"1.5.1."},{"$f":"IF(OFFSET(PO!N$12,ROW(C51)-ROW(C$12),0)=0,\"\",OFFSET(PO!N$12,ROW(C51)-ROW(C$12),0))","v":"CHAPISCO APLICADO EM ALVENARIAS E ESTRUTURAS DE CONCRETO INTERNAS, COM COLHER DE PEDREIRO.  ARGAMASSA TRAÇO 1:3 COM PREPARO MANUAL. AF_10/2022"},{"$f":"IF(OFFSET(PO!O$12,ROW(D51)-ROW(D$12),0)=0,\"\",OFFSET(PO!O$12,ROW(D51)-ROW(D$12),0))","v":"M2"},{"$f":"IF($A51<>\"Serviço\",0,ROUND(SUMIF($F$9:$P$9,\"<>\",$F51:$P51),15-13*PO!$X$3))","v":43.91},43.91]
[{"$f":"OFFSET(PO!J$12,ROW(A52)-ROW($A$12),0)","v":"Serviço"},{"$f":"IF($A52=0,\"\",OFFSET(PO!K$12,ROW(B52)-ROW(B$12),0))","v":"1.5.2."},{"$f":"IF(OFFSET(PO!N$12,ROW(C52)-ROW(C$12),0)=0,\"\",OFFSET(PO!N$12,ROW(C52)-ROW(C$12),0))","v":"EMBOÇO OU MASSA ÚNICA EM ARGAMASSA TRAÇO 1:2:8, PREPARO MANUAL, APLICADA MANUALMENTE EM PANOS DE FACHADA COM PRESENÇA DE VÃOS, ESPESSURA DE 25 MM. AF_08/2022"},{"$f":"IF(OFFSET(PO!O$12,ROW(D52)-ROW(D$12),0)=0,\"\",OFFSET(PO!O$12,ROW(D52)-ROW(D$12),0))","v":"M2"},{"$f":"IF($A52<>\"Serviço\",0,ROUND(SUMIF($F$9:$P$9,\"<>\",$F52:$P52),15-13*PO!$X$3))","v":43.91},43.91]
[{"$f":"OFFSET(PO!J$12,ROW(A53)-ROW($A$12),0)","v":"Serviço"},{"$f":"IF($A53=0,\"\",OFFSET(PO!K$12,ROW(B53)-ROW(B$12),0))","v":"1.5.3."},{"$f":"IF(OFFSET(PO!N$12,ROW(C53)-ROW(C$12),0)=0,\"\",OFFSET(PO!N$12,ROW(C53)-ROW(C$12),0))","v":"APLICAÇÃO DE FUNDO SELADOR ACRÍLICO EM PAREDES, UMA DEMÃO. AF_06/2014"},{"$f":"IF(OFFSET(PO!O$12,ROW(D53)-ROW(D$12),0)=0,\"\",OFFSET(PO!O$12,ROW(D53)-ROW(D$12),0))","v":"M2"},{"$f":"IF($A53<>\"Serviço\",0,ROUND(SUMIF($F$9:$P$9,\"<>\",$F53:$P53),15-13*PO!$X$3))","v":43.91},43.91]
[{"$f":"OFFSET(PO!J$12,ROW(A54)-ROW($A$12),0)","v":"Serviço"},{"$f":"IF($A54=0,\"\",OFFSET(PO!K$12,ROW(B54)-ROW(B$12),0))","v":"1.5.4."},{"$f":"IF(OFFSET(PO!N$12,ROW(C54)-ROW(C$12),0)=0,\"\",OFFSET(PO!N$12,ROW(C54)-ROW(C$12),0))","v":"APLICAÇÃO MANUAL DE PINTURA COM TINTA LÁTEX ACRÍLICA EM PAREDES, DUAS DEMÃOS. AF_06/2014"},{"$f":"IF(OFFSET(PO!O$12,ROW(D54)-ROW(D$12),0)=0,\"\",OFFSET(PO!O$12,ROW(D54)-ROW(D$12),0))","v":"M2"},{"$f":"IF($A54<>\"Serviço\",0,ROUND(SUMIF($F$9:$P$9,\"<>\",$F54:$P54),15-13*PO!$X$3))","v":43.91},43.91]
[{"$f":"OFFSET(PO!J$12,ROW(A55)-ROW($A$12),0)","v":"Serviço"},{"$f":"IF($A55=0,\"\",OFFSET(PO!K$12,ROW(B55)-ROW(B$12),0))","v":"1.5.5."},{"$f":"IF(OFFSET(PO!N$12,ROW(C55)-ROW(C$12),0)=0,\"\",OFFSET(PO!N$12,ROW(C55)-ROW(C$12),0))","v":"EMBOÇO, PARA RECEBIMENTO DE CERÂMICA, EM ARGAMASSA TRAÇO 1:2:8, PREPARO MANUAL, APLICADO MANUALMENTE EM FACES INTERNAS DE PAREDES, PARA AMBIENTE COM ÁREA MENOR QUE 5M2, ESPESSURA DE 20MM, COM EXECUÇÃO DE TALISCAS. AF_06/2014"},{"$f":"IF(OFFSET(PO!O$12,ROW(D55)-ROW(D$12),0)=0,\"\",OFFSET(PO!O$12,ROW(D55)-ROW(D$12),0))","v":"M2"},{"$f":"IF($A55<>\"Serviço\",0,ROUND(SUMIF($F$9:$P$9,\"<>\",$F55:$P55),15-13*PO!$X$3))","v":20.41},20.41]
[{"$f":"OFFSET(PO!J$12,ROW(A56)-ROW($A$12),0)","v":"Serviço"},{"$f":"IF($A56=0,\"\",OFFSET(PO!K$12,ROW(B56)-ROW(B$12),0))","v":"1.5.6."},{"$f":"IF(OFFSET(PO!N$12,ROW(C56)-ROW(C$12),0)=0,\"\",OFFSET(PO!N$12,ROW(C56)-ROW(C$12),0))","v":"REVESTIMENTO CERÂMICO PARA PAREDES INTERNAS COM PLACAS TIPO ESMALTADA EXTRA DE DIMENSÕES 60X60 CM APLICADAS NA ALTURA INTEIRA DAS PAREDES. AF_02/2023_PE"},{"$f":"IF(OFFSET(PO!O$12,ROW(D56)-ROW(D$12),0)=0,\"\",OFFSET(PO!O$12,ROW(D56)-ROW(D$12),0))","v":"M2"},{"$f":"IF($A56<>\"Serviço\",0,ROUND(SUMIF($F$9:$P$9,\"<>\",$F56:$P56),15-13*PO!$X$3))","v":20.41},20.41]
[{"$f":"OFFSET(PO!J$12,ROW(A57)-ROW($A$12),0)","v":"Serviço"},{"$f":"IF($A57=0,\"\",OFFSET(PO!K$12,ROW(B57)-ROW(B$12),0))","v":"1.5.7."},{"$f":"IF(OFFSET(PO!N$12,ROW(C57)-ROW(C$12),0)=0,\"\",OFFSET(PO!N$12,ROW(C57)-ROW(C$12),0))","v":"PINTURA VERNIZ (INCOLOR) ALQUÍDICO EM MADEIRA, USO INTERNO E EXTERNO, 2 DEMÃOS. AF_01/2021"},{"$f":"IF(OFFSET(PO!O$12,ROW(D57)-ROW(D$12),0)=0,\"\",OFFSET(PO!O$12,ROW(D57)-ROW(D$12),0))","v":"M2"},{"$f":"IF($A57<>\"Serviço\",0,ROUND(SUMIF($F$9:$P$9,\"<>\",$F57:$P57),15-13*PO!$X$3))","v":103.92},103.92]
[{"$f":"OFFSET(PO!J$12,ROW(A58)-ROW($A$12),0)","v":"Serviço"},{"$f":"IF($A58=0,\"\",OFFSET(PO!K$12,ROW(B58)-ROW(B$12),0))","v":"1.5.8."},{"$f":"IF(OFFSET(PO!N$12,ROW(C58)-ROW(C$12),0)=0,\"\",OFFSET(PO!N$12,ROW(C58)-ROW(C$12),0))","v":"PINTURA TINTA DE ACABAMENTO (PIGMENTADA) ESMALTE SINTÉTICO BRILHANTE EM MADEIRA, 2 DEMÃOS. AF_01/2021"},{"$f":"IF(OFFSET(PO!O$12,ROW(D58)-ROW(D$12),0)=0,\"\",OFFSET(PO!O$12,ROW(D58)-ROW(D$12),0))","v":"M2"},{"$f":"IF($A58<>\"Serviço\",0,ROUND(SUMIF($F$9:$P$9,\"<>\",$F58:$P58),15-13*PO!$X$3))","v":6.6},6.6]
[{"$f":"OFFSET(PO!J$12,ROW(A59)-ROW($A$12),0)","v":"Nível 2"},{"$f":"IF($A59=0,\"\",OFFSET(PO!K$12,ROW(B59)-ROW(B$12),0))","v":"1.6."},{"$f":"IF(OFFSET(PO!N$12,ROW(C59)-ROW(C$12),0)=0,\"\",OFFSET(PO!N$12,ROW(C59)-ROW(C$12),0))","v":"PAVIMENTAÇÃO INTERNA"},{"$f":"IF(OFFSET(PO!O$12,ROW(D59)-ROW(D$12),0)=0,\"\",OFFSET(PO!O$12,ROW(D59)-ROW(D$12),0))","v":""},{"$f":"IF($A59<>\"Serviço\",0,ROUND(SUMIF($F$9:$P$9,\"<>\",$F59:$P59),15-13*PO!$X$3))","v":0}]
[{"$f":"OFFSET(PO!J$12,ROW(A60)-ROW($A$12),0)","v":"Serviço"},{"$f":"IF($A60=0,\"\",OFFSET(PO!K$12,ROW(B60)-ROW(B$12),0))","v":"1.6.1."},{"$f":"IF(OFFSET(PO!N$12,ROW(C60)-ROW(C$12),0)=0,\"\",OFFSET(PO!N$12,ROW(C60)-ROW(C$12),0))","v":"LASTRO COM MATERIAL GRANULAR (PEDRA BRITADA N.1 E PEDRA BRITADA N.2), APLICADO EM PISOS OU LAJES SOBRE SOLO, ESPESSURA DE *10 CM*. AF_07/2019"},{"$f":"IF(OFFSET(PO!O$12,ROW(D60)-ROW(D$12),0)=0,\"\",OFFSET(PO!O$12,ROW(D60)-ROW(D$12),0))","v":"M3"},{"$f":"IF($A60<>\"Serviço\",0,ROUND(SUMIF($F$9:$P$9,\"<>\",$F60:$P60),15-13*PO!$X$3))","v":2.3199999999999998},2.3199999999999998]
[{"$f":"OFFSET(PO!J$12,ROW(A61)-ROW($A$12),0)","v":"Serviço"},{"$f":"IF($A61=0,\"\",OFFSET(PO!K$12,ROW(B61)-ROW(B$12),0))","v":"1.6.2."},{"$f":"IF(OFFSET(PO!N$12,ROW(C61)-ROW(C$12),0)=0,\"\",OFFSET(PO!N$12,ROW(C61)-ROW(C$12),0))","v":"LASTRO DE CONCRETO MAGRO, APLICADO EM PISOS, LAJES SOBRE SOLO OU RADIERS, ESPESSURA DE 5 CM. AF_07/2016"},{"$f":"IF(OFFSET(PO!O$12,ROW(D61)-ROW(D$12),0)=0,\"\",OFFSET(PO!O$12,ROW(D61)-ROW(D$12),0))","v":"M2"},{"$f":"IF($A61<>\"Serviço\",0,ROUND(SUMIF($F$9:$P$9,\"<>\",$F61:$P61),15-13*PO!$X$3))","v":46.36},46.36]
[{"$f":"OFFSET(PO!J$12,ROW(A62)-ROW($A$12),0)","v":"Serviço"},{"$f":"IF($A62=0,\"\",OFFSET(PO!K$12,ROW(B62)-ROW(B$12),0))","v":"1.6.3."},{"$f":"IF(OFFSET(PO!N$12,ROW(C62)-ROW(C$12),0)=0,\"\",OFFSET(PO!N$12,ROW(C62)-ROW(C$12),0))","v":"REVESTIMENTO CERÂMICO PARA PISO COM PLACAS TIPO ESMALTADA EXTRA DE DIMENSÕES 45X45 CM APLICADA EM AMBIENTES DE ÁREA MAIOR QUE 10 M2. AF_02/2023_PE"},{"$f":"IF(OFFSET(PO!O$12,ROW(D62)-ROW(D$12),0)=0,\"\",OFFSET(PO!O$12,ROW(D62)-ROW(D$12),0))","v":"M2"},{"$f":"IF($A62<>\"Serviço\",0,ROUND(SUMIF($F$9:$P$9,\"<>\",$F62:$P62),15-13*PO!$X$3))","v":48.68},48.68]
[{"$f":"OFFSET(PO!J$12,ROW(A63)-ROW($A$12),0)","v":"Serviço"},{"$f":"IF($A63=0,\"\",OFFSET(PO!K$12,ROW(B63)-ROW(B$12),0))","v":"1.6.4."},{"$f":"IF(OFFSET(PO!N$12,ROW(C63)-ROW(C$12),0)=0,\"\",OFFSET(PO!N$12,ROW(C63)-ROW(C$12),0))","v":"RODAPÉ EM MADEIRA, ALTURA 7CM, FIXADO COM COLA E PARAFUSOS. AF_09/2020"},{"$f":"IF(OFFSET(PO!O$12,ROW(D63)-ROW(D$12),0)=0,\"\",OFFSET(PO!O$12,ROW(D63)-ROW(D$12),0))","v":"M"},{"$f":"IF($A63<>\"Serviço\",0,ROUND(SUMIF($F$9:$P$9,\"<>\",$F63:$P63),15-13*PO!$X$3))","v":35.21},35.21]
[{"$f":"OFFSET(PO!J$12,ROW(A64)-ROW($A$12),0)","v":"Serviço"},{"$f":"IF($A64=0,\"\",OFFSET(PO!K$12,ROW(B64)-ROW(B$12),0))","v":"1.6.5."},{"$f":"IF(OFFSET(PO!N$12,ROW(C64)-ROW(C$12),0)=0,\"\",OFFSET(PO!N$12,ROW(C64)-ROW(C$12),0))","v":"RODAPÉ CERÂMICO DE 7CM DE ALTURA COM PLACAS TIPO ESMALTADA EXTRA DE DIMENSÕES 45X45CM. AF_02/2023"},{"$f":"IF(OFFSET(PO!O$12,ROW(D64)-ROW(D$12),0)=0,\"\",OFFSET(PO!O$12,ROW(D64)-ROW(D$12),0))","v":"M"},{"$f":"IF($A64<>\"Serviço\",0,ROUND(SUMIF($F$9:$P$9,\"<>\",$F64:$P64),15-13*PO!$X$3))","v":4.3499999999999996},4.3499999999999996]
[{"$f":"OFFSET(PO!J$12,ROW(A65)-ROW($A$12),0)","v":"Nível 2"},{"$f":"IF($A65=0,\"\",OFFSET(PO!K$12,ROW(B65)-ROW(B$12),0))","v":"1.7."},{"$f":"IF(OFFSET(PO!N$12,ROW(C65)-ROW(C$12),0)=0,\"\",OFFSET(PO!N$12,ROW(C65)-ROW(C$12),0))","v":"FORRO E COBERTURA"},{"$f":"IF(OFFSET(PO!O$12,ROW(D65)-ROW(D$12),0)=0,\"\",OFFSET(PO!O$12,ROW(D65)-ROW(D$12),0))","v":""},{"$f":"IF($A65<>\"Serviço\",0,ROUND(SUMIF($F$9:$P$9,\"<>\",$F65:$P65),15-13*PO!$X$3))","v":0}]
[{"$f":"OFFSET(PO!J$12,ROW(A66)-ROW($A$12),0)","v":"Serviço"},{"$f":"IF($A66=0,\"\",OFFSET(PO!K$12,ROW(B66)-ROW(B$12),0))","v":"1.7.1."},{"$f":"IF(OFFSET(PO!N$12,ROW(C66)-ROW(C$12),0)=0,\"\",OFFSET(PO!N$12,ROW(C66)-ROW(C$12),0))","v":"FORRO EM RÉGUAS DE PVC, FRISADO, PARA AMBIENTES RESIDENCIAIS, INCLUSIVE ESTRUTURA DE FIXAÇÃO. AF_05/2017_PS"},{"$f":"IF(OFFSET(PO!O$12,ROW(D66)-ROW(D$12),0)=0,\"\",OFFSET(PO!O$12,ROW(D66)-ROW(D$12),0))","v":"M2"},{"$f":"IF($A66<>\"Serviço\",0,ROUND(SUMIF($F$9:$P$9,\"<>\",$F66:$P66),15-13*PO!$X$3))","v":62.36},62.36]
[{"$f":"OFFSET(PO!J$12,ROW(A67)-ROW($A$12),0)","v":"Serviço"},{"$f":"IF($A67=0,\"\",OFFSET(PO!K$12,ROW(B67)-ROW(B$12),0))","v":"1.7.2."},{"$f":"IF(OFFSET(PO!N$12,ROW(C67)-ROW(C$12),0)=0,\"\",OFFSET(PO!N$12,ROW(C67)-ROW(C$12),0))","v":"ACABAMENTOS PARA FORRO (RODA-FORRO EM PERFIL METÁLICO E PLÁSTICO). AF_05/2017"},{"$f":"IF(OFFSET(PO!O$12,ROW(D67)-ROW(D$12),0)=0,\"\",OFFSET(PO!O$12,ROW(D67)-ROW(D$12),0))","v":"M"},{"$f":"IF($A67<>\"Serviço\",0,ROUND(SUMIF($F$9:$P$9,\"<>\",$F67:$P67),15-13*PO!$X$3))","v":73.150000000000006},73.150000000000006]
[{"$f":"OFFSET(PO!J$12,ROW(A68)-ROW($A$12),0)","v":"Serviço"},{"$f":"IF($A68=0,\"\",OFFSET(PO!K$12,ROW(B68)-ROW(B$12),0))","v":"1.7.3."},{"$f":"IF(OFFSET(PO!N$12,ROW(C68)-ROW(C$12),0)=0,\"\",OFFSET(PO!N$12,ROW(C68)-ROW(C$12),0))","v":"INSTALAÇÃO DE TESOURA (INTEIRA OU MEIA), BIAPOIADA, EM MADEIRA NÃO APARELHADA, PARA VÃOS MAIORES OU IGUAIS A 3,0 M E MENORES QUE 6,0 M, INCLUSO IÇAMENTO. AF_07/2019"},{"$f":"IF(OFFSET(PO!O$12,ROW(D68)-ROW(D$12),0)=0,\"\",OFFSET(PO!O$12,ROW(D68)-ROW(D$12),0))","v":"UN"},{"$f":"IF($A68<>\"Serviço\",0,ROUND(SUMIF($F$9:$P$9,\"<>\",$F68:$P68),15-13*PO!$X$3))","v":9},9]
[{"$f":"OFFSET(PO!J$12,ROW(A69)-ROW($A$12),0)","v":"Serviço"},{"$f":"IF($A69=0,\"\",OFFSET(PO!K$12,ROW(B69)-ROW(B$12),0))","v":"1.7.4."},{"$f":"IF(OFFSET(PO!N$12,ROW(C69)-ROW(C$12),0)=0,\"\",OFFSET(PO!N$12,ROW(C69)-ROW(C$12),0))","v":"TELHAMENTO COM TELHA ONDULADA DE FIBROCIMENTO E = 6 MM, COM RECOBRIMENTO LATERAL DE 1/4 DE ONDA PARA TELHADO COM INCLINAÇÃO MAIOR QUE 10°, COM ATÉ 2 ÁGUAS, INCLUSO IÇAMENTO. AF_07/2019"},{"$f":"IF(OFFSET(PO!O$12,ROW(D69)-ROW(D$12),0)=0,\"\",OFFSET(PO!O$12,ROW(D69)-ROW(D$12),0))","v":"M2"},{"$f":"IF($A69<>\"Serviço\",0,ROUND(SUMIF($F$9:$P$9,\"<>\",$F69:$P69),15-13*PO!$X$3))","v":73.739999999999995},73.739999999999995]
[{"$f":"OFFSET(PO!J$12,ROW(A70)-ROW($A$12),0)","v":"Serviço"},{"$f":"IF($A70=0,\"\",OFFSET(PO!K$12,ROW(B70)-ROW(B$12),0))","v":"1.7.5."},{"$f":"IF(OFFSET(PO!N$12,ROW(C70)-ROW(C$12),0)=0,\"\",OFFSET(PO!N$12,ROW(C70)-ROW(C$12),0))","v":"CUMEEIRA SHED PARA TELHA ONDULADA DE FIBROCIMENTO, E = 6 MM, INCLUSO ACESSÓRIOS DE FIXAÇÃO E IÇAMENTO. AF_07/2019"},{"$f":"IF(OFFSET(PO!O$12,ROW(D70)-ROW(D$12),0)=0,\"\",OFFSET(PO!O$12,ROW(D70)-ROW(D$12),0))","v":"M"},{"$f":"IF($A70<>\"Serviço\",0,ROUND(SUMIF($F$9:$P$9,\"<>\",$F70:$P70),15-13*PO!$X$3))","v":9.5},9.5]
[{"$f":"OFFSET(PO!J$12,ROW(A71)-ROW($A$12),0)","v":"Nível 2"},{"$f":"IF($A71=0,\"\",OFFSET(PO!K$12,ROW(B71)-ROW(B$12),0))","v":"1.8."},{"$f":"IF(OFFSET(PO!N$12,ROW(C71)-ROW(C$12),0)=0,\"\",OFFSET(PO!N$12,ROW(C71)-ROW(C$12),0))","v":"ISTALAÇÕES ELÉTRICA"},{"$f":"IF(OFFSET(PO!O$12,ROW(D71)-ROW(D$12),0)=0,\"\",OFFSET(PO!O$12,ROW(D71)-ROW(D$12),0))","v":""},{"$f":"IF($A71<>\"Serviço\",0,ROUND(SUMIF($F$9:$P$9,\"<>\",$F71:$P71),15-13*PO!$X$3))","v":0}]
[{"$f":"OFFSET(PO!J$12,ROW(A72)-ROW($A$12),0)","v":"Serviço"},{"$f":"IF($A72=0,\"\",OFFSET(PO!K$12,ROW(B72)-ROW(B$12),0))","v":"1.8.1."},{"$f":"IF(OFFSET(PO!N$12,ROW(C72)-ROW(C$12),0)=0,\"\",OFFSET(PO!N$12,ROW(C72)-ROW(C$12),0))","v":"CAIXA RETANGULAR 4\" X 2\" MÉDIA (1,30 M DO PISO), PVC, INSTALADA EM PAREDE - FORNECIMENTO E INSTALAÇÃO. AF_03/2023"},{"$f":"IF(OFFSET(PO!O$12,ROW(D72)-ROW(D$12),0)=0,\"\",OFFSET(PO!O$12,ROW(D72)-ROW(D$12),0))","v":"UN"},{"$f":"IF($A72<>\"Serviço\",0,ROUND(SUMIF($F$9:$P$9,\"<>\",$F72:$P72),15-13*PO!$X$3))","v":18},18]
[{"$f":"OFFSET(PO!J$12,ROW(A73)-ROW($A$12),0)","v":"Serviço"},{"$f":"IF($A73=0,\"\",OFFSET(PO!K$12,ROW(B73)-ROW(B$12),0))","v":"1.8.2."},{"$f":"IF(OFFSET(PO!N$12,ROW(C73)-ROW(C$12),0)=0,\"\",OFFSET(PO!N$12,ROW(C73)-ROW(C$12),0))","v":"CAIXA RETANGULAR 4\" X 4\" MÉDIA (1,30 M DO PISO), PVC, INSTALADA EM PAREDE - FORNECIMENTO E INSTALAÇÃO. AF_03/2023"},{"$f":"IF(OFFSET(PO!O$12,ROW(D73)-ROW(D$12),0)=0,\"\",OFFSET(PO!O$12,ROW(D73)-ROW(D$12),0))","v":"UN"},{"$f":"IF($A73<>\"Serviço\",0,ROUND(SUMIF($F$9:$P$9,\"<>\",$F73:$P73),15-13*PO!$X$3))","v":1},1]
[{"$f":"OFFSET(PO!J$12,ROW(A74)-ROW($A$12),0)","v":"Serviço"},{"$f":"IF($A74=0,\"\",OFFSET(PO!K$12,ROW(B74)-ROW(B$12),0))","v":"1.8.3."},{"$f":"IF(OFFSET(PO!N$12,ROW(C74)-ROW(C$12),0)=0,\"\",OFFSET(PO!N$12,ROW(C74)-ROW(C$12),0))","v":"CAIXA OCTOGONAL 3\" X 3\", PVC, INSTALADA EM LAJE - FORNECIMENTO E INSTALAÇÃO. AF_03/2023"},{"$f":"IF(OFFSET(PO!O$12,ROW(D74)-ROW(D$12),0)=0,\"\",OFFSET(PO!O$12,ROW(D74)-ROW(D$12),0))","v":"UN"},{"$f":"IF($A74<>\"Serviço\",0,ROUND(SUMIF($F$9:$P$9,\"<>\",$F74:$P74),15-13*PO!$X$3))","v":9},9]
[{"$f":"OFFSET(PO!J$12,ROW(A75)-ROW($A$12),0)","v":"Serviço"},{"$f":"IF($A75=0,\"\",OFFSET(PO!K$12,ROW(B75)-ROW(B$12),0))","v":"1.8.4."},{"$f":"IF(OFFSET(PO!N$12,ROW(C75)-ROW(C$12),0)=0,\"\",OFFSET(PO!N$12,ROW(C75)-ROW(C$12),0))","v":"CABO DE COBRE FLEXÍVEL ISOLADO, 1,5 MM², ANTI-CHAMA 450/750 V, PARA CIRCUITOS TERMINAIS - FORNECIMENTO E INSTALAÇÃO. AF_03/2023"},{"$f":"IF(OFFSET(PO!O$12,ROW(D75)-ROW(D$12),0)=0,\"\",OFFSET(PO!O$12,ROW(D75)-ROW(D$12),0))","v":"M"},{"$f":"IF($A75<>\"Serviço\",0,ROUND(SUMIF($F$9:$P$9,\"<>\",$F75:$P75),15-13*PO!$X$3))","v":85.3},85.3]
[{"$f":"OFFSET(PO!J$12,ROW(A76)-ROW($A$12),0)","v":"Serviço"},{"$f":"IF($A76=0,\"\",OFFSET(PO!K$12,ROW(B76)-ROW(B$12),0))","v":"1.8.5."},{"$f":"IF(OFFSET(PO!N$12,ROW(C76)-ROW(C$12),0)=0,\"\",OFFSET(PO!N$12,ROW(C76)-ROW(C$12),0))","v":"CABO DE COBRE FLEXÍVEL ISOLADO, 2,5 MM², ANTI-CHAMA 450/750 V, PARA CIRCUITOS TERMINAIS - FORNECIMENTO E INSTALAÇÃO. AF_03/2023"},{"$f":"IF(OFFSET(PO!O$12,ROW(D76)-ROW(D$12),0)=0,\"\",OFFSET(PO!O$12,ROW(D76)-ROW(D$12),0))","v":"M"},{"$f":"IF($A76<>\"Serviço\",0,ROUND(SUMIF($F$9:$P$9,\"<>\",$F76:$P76),15-13*PO!$X$3))","v":182},182]
[{"$f":"OFFSET(PO!J$12,ROW(A77)-ROW($A$12),0)","v":"Serviço"},{"$f":"IF($A77=0,\"\",OFFSET(PO!K$12,ROW(B77)-ROW(B$12),0))","v":"1.8.6."},{"$f":"IF(OFFSET(PO!N$12,ROW(C77)-ROW(C$12),0)=0,\"\",OFFSET(PO!N$12,ROW(C77)-ROW(C$12),0))","v":"CABO DE COBRE FLEXÍVEL ISOLADO, 4 MM², ANTI-CHAMA 450/750 V, PARA CIRCUITOS TERMINAIS - FORNECIMENTO E INSTALAÇÃO. AF_03/2023"},{"$f":"IF(OFFSET(PO!O$12,ROW(D77)-ROW(D$12),0)=0,\"\",OFFSET(PO!O$12,ROW(D77)-ROW(D$12),0))","v":"M"},{"$f":"IF($A77<>\"Serviço\",0,ROUND(SUMIF($F$9:$P$9,\"<>\",$F77:$P77),15-13*PO!$X$3))","v":14},14]
[{"$f":"OFFSET(PO!J$12,ROW(A78)-ROW($A$12),0)","v":"Serviço"},{"$f":"IF($A78=0,\"\",OFFSET(PO!K$12,ROW(B78)-ROW(B$12),0))","v":"1.8.7."},{"$f":"IF(OFFSET(PO!N$12,ROW(C78)-ROW(C$12),0)=0,\"\",OFFSET(PO!N$12,ROW(C78)-ROW(C$12),0))","v":"CABO DE COBRE FLEXÍVEL ISOLADO, 6 MM², ANTI-CHAMA 450/750 V, PARA CIRCUITOS TERMINAIS - FORNECIMENTO E INSTALAÇÃO. AF_03/2023"},{"$f":"IF(OFFSET(PO!O$12,ROW(D78)-ROW(D$12),0)=0,\"\",OFFSET(PO!O$12,ROW(D78)-ROW(D$12),0))","v":"M"},{"$f":"IF($A78<>\"Serviço\",0,ROUND(SUMIF($F$9:$P$9,\"<>\",$F78:$P78),15-13*PO!$X$3))","v":10},10]
[{"$f":"OFFSET(PO!J$12,ROW(A79)-ROW($A$12),0)","v":"Serviço"},{"$f":"IF($A79=0,\"\",OFFSET(PO!K$12,ROW(B79)-ROW(B$12),0))","v":"1.8.8."},{"$f":"IF(OFFSET(PO!N$12,ROW(C79)-ROW(C$12),0)=0,\"\",OFFSET(PO!N$12,ROW(C79)-ROW(C$12),0))","v":"CABO DE COBRE FLEXÍVEL ISOLADO, 10 MM², ANTI-CHAMA 450/750 V, PARA CIRCUITOS TERMINAIS - FORNECIMENTO E INSTALAÇÃO. AF_03/2023"},{"$f":"IF(OFFSET(PO!O$12,ROW(D79)-ROW(D$12),0)=0,\"\",OFFSET(PO!O$12,ROW(D79)-ROW(D$12),0))","v":"M"},{"$f":"IF($A79<>\"Serviço\",0,ROUND(SUMIF($F$9:$P$9,\"<>\",$F79:$P79),15-13*PO!$X$3))","v":22},22]
[{"$f":"OFFSET(PO!J$12,ROW(A80)-ROW($A$12),0)","v":"Serviço"},{"$f":"IF($A80=0,\"\",OFFSET(PO!K$12,ROW(B80)-ROW(B$12),0))","v":"1.8.9."},{"$f":"IF(OFFSET(PO!N$12,ROW(C80)-ROW(C$12),0)=0,\"\",OFFSET(PO!N$12,ROW(C80)-ROW(C$12),0))","v":"INTERRUPTOR SIMPLES (1 MÓDULO) COM 1 TOMADA DE EMBUTIR 2P+T 10 A, INCLUINDO SUPORTE E PLACA - FORNECIMENTO E INSTALAÇÃO. AF_03/2023"},{"$f":"IF(OFFSET(PO!O$12,ROW(D80)-ROW(D$12),0)=0,\"\",OFFSET(PO!O$12,ROW(D80)-ROW(D$12),0))","v":"UN"},{"$f":"IF($A80<>\"Serviço\",0,ROUND(SUMIF($F$9:$P$9,\"<>\",$F80:$P80),15-13*PO!$X$3))","v":3},3]
[{"$f":"OFFSET(PO!J$12,ROW(A81)-ROW($A$12),0)","v":"Serviço"},{"$f":"IF($A81=0,\"\",OFFSET(PO!K$12,ROW(B81)-ROW(B$12),0))","v":"1.8.10."},{"$f":"IF(OFFSET(PO!N$12,ROW(C81)-ROW(C$12),0)=0,\"\",OFFSET(PO!N$12,ROW(C81)-ROW(C$12),0))","v":"INTERRUPTOR SIMPLES (2 MÓDULOS), 10A/250V, INCLUINDO SUPORTE E PLACA - FORNECIMENTO E INSTALAÇÃO. AF_03/2023"},{"$f":"IF(OFFSET(PO!O$12,ROW(D81)-ROW(D$12),0)=0,\"\",OFFSET(PO!O$12,ROW(D81)-ROW(D$12),0))","v":"UN"},{"$f":"IF($A81<>\"Serviço\",0,ROUND(SUMIF($F$9:$P$9,\"<>\",$F81:$P81),15-13*PO!$X$3))","v":3},3]
[{"$f":"OFFSET(PO!J$12,ROW(A82)-ROW($A$12),0)","v":"Serviço"},{"$f":"IF($A82=0,\"\",OFFSET(PO!K$12,ROW(B82)-ROW(B$12),0))","v":"1.8.11."},{"$f":"IF(OFFSET(PO!N$12,ROW(C82)-ROW(C$12),0)=0,\"\",OFFSET(PO!N$12,ROW(C82)-ROW(C$12),0))","v":"TOMADA MÉDIA DE EMBUTIR (1 MÓDULO), 2P+T 10 A, INCLUINDO SUPORTE E PLACA - FORNECIMENTO E INSTALAÇÃO. AF_03/2023"},{"$f":"IF(OFFSET(PO!O$12,ROW(D82)-ROW(D$12),0)=0,\"\",OFFSET(PO!O$12,ROW(D82)-ROW(D$12),0))","v":"UN"},{"$f":"IF($A82<>\"Serviço\",0,ROUND(SUMIF($F$9:$P$9,\"<>\",$F82:$P82),15-13*PO!$X$3))","v":12},12]
[{"$f":"OFFSET(PO!J$12,ROW(A83)-ROW($A$12),0)","v":"Serviço"},{"$f":"IF($A83=0,\"\",OFFSET(PO!K$12,ROW(B83)-ROW(B$12),0))","v":"1.8.12."},{"$f":"IF(OFFSET(PO!N$12,ROW(C83)-ROW(C$12),0)=0,\"\",OFFSET(PO!N$12,ROW(C83)-ROW(C$12),0))","v":"TOMADA MÉDIA DE EMBUTIR (2 MÓDULOS), 2P+T 10 A, INCLUINDO SUPORTE E PLACA - FORNECIMENTO E INSTALAÇÃO. AF_03/2023"},{"$f":"IF(OFFSET(PO!O$12,ROW(D83)-ROW(D$12),0)=0,\"\",OFFSET(PO!O$12,ROW(D83)-ROW(D$12),0))","v":"UN"},{"$f":"IF($A83<>\"Serviço\",0,ROUND(SUMIF($F$9:$P$9,\"<>\",$F83:$P83),15-13*PO!$X$3))","v":1},1]
[{"$f":"OFFSET(PO!J$12,ROW(A84)-ROW($A$12),0)","v":"Serviço"},{"$f":"IF($A84=0,\"\",OFFSET(PO!K$12,ROW(B84)-ROW(B$12),0))","v":"1.8.13."},{"$f":"IF(OFFSET(PO!N$12,ROW(C84)-ROW(C$12),0)=0,\"\",OFFSET(PO!N$12,ROW(C84)-ROW(C$12),0))","v":"ESPELHO / PLACA CEGA 4\" X 2\", PARA INSTALACAO DE TOMADAS E INTERRUPTORES"},{"$f":"IF(OFFSET(PO!O$12,ROW(D84)-ROW(D$12),0)=0,\"\",OFFSET(PO!O$12,ROW(D84)-ROW(D$12),0))","v":"UN    "},{"$f":"IF($A84<>\"Serviço\",0,ROUND(SUMIF($F$9:$P$9,\"<>\",$F84:$P84),15-13*PO!$X$3))","v":1},1]
[{"$f":"OFFSET(PO!J$12,ROW(A85)-ROW($A$12),0)","v":"Serviço"},{"$f":"IF($A85=0,\"\",OFFSET(PO!K$12,ROW(B85)-ROW(B$12),0))","v":"1.8.14."},{"$f":"IF(OFFSET(PO!N$12,ROW(C85)-ROW(C$12),0)=0,\"\",OFFSET(PO!N$12,ROW(C85)-ROW(C$12),0))","v":"DISJUNTOR MONOPOLAR TIPO DIN, CORRENTE NOMINAL DE 20A - FORNECIMENTO E INSTALAÇÃO. AF_10/2020"},{"$f":"IF(OFFSET(PO!O$12,ROW(D85)-ROW(D$12),0)=0,\"\",OFFSET(PO!O$12,ROW(D85)-ROW(D$12),0))","v":"UN"},{"$f":"IF($A85<>\"Serviço\",0,ROUND(SUMIF($F$9:$P$9,\"<>\",$F85:$P85),15-13*PO!$X$3))","v":3},3]
[{"$f":"OFFSET(PO!J$12,ROW(A86)-ROW($A$12),0)","v":"Serviço"},{"$f":"IF($A86=0,\"\",OFFSET(PO!K$12,ROW(B86)-ROW(B$12),0))","v":"1.8.15."},{"$f":"IF(OFFSET(PO!N$12,ROW(C86)-ROW(C$12),0)=0,\"\",OFFSET(PO!N$12,ROW(C86)-ROW(C$12),0))","v":"DISJUNTOR MONOPOLAR TIPO DIN, CORRENTE NOMINAL DE 32A - FORNECIMENTO E INSTALAÇÃO. AF_10/2020"},{"$f":"IF(OFFSET(PO!O$12,ROW(D86)-ROW(D$12),0)=0,\"\",OFFSET(PO!O$12,ROW(D86)-ROW(D$12),0))","v":"UN"},{"$f":"IF($A86<>\"Serviço\",0,ROUND(SUMIF($F$9:$P$9,\"<>\",$F86:$P86),15-13*PO!$X$3))","v":1},1]
[{"$f":"OFFSET(PO!J$12,ROW(A87)-ROW($A$12),0)","v":"Serviço"},{"$f":"IF($A87=0,\"\",OFFSET(PO!K$12,ROW(B87)-ROW(B$12),0))","v":"1.8.16."},{"$f":"IF(OFFSET(PO!N$12,ROW(C87)-ROW(C$12),0)=0,\"\",OFFSET(PO!N$12,ROW(C87)-ROW(C$12),0))","v":"DISPOSITIVO DR, 2 POLOS, SENSIBILIDADE DE 30 MA, CORRENTE DE 25 A, TIPO AC"},{"$f":"IF(OFFSET(PO!O$12,ROW(D87)-ROW(D$12),0)=0,\"\",OFFSET(PO!O$12,ROW(D87)-ROW(D$12),0))","v":"UN    "},{"$f":"IF($A87<>\"Serviço\",0,ROUND(SUMIF($F$9:$P$9,\"<>\",$F87:$P87),15-13*PO!$X$3))","v":1},1]
[{"$f":"OFFSET(PO!J$12,ROW(A88)-ROW($A$12),0)","v":"Serviço"},{"$f":"IF($A88=0,\"\",OFFSET(PO!K$12,ROW(B88)-ROW(B$12),0))","v":"1.8.17."},{"$f":"IF(OFFSET(PO!N$12,ROW(C88)-ROW(C$12),0)=0,\"\",OFFSET(PO!N$12,ROW(C88)-ROW(C$12),0))","v":"DISJUNTOR TIPO DIN/IEC, BIPOLAR 63 A"},{"$f":"IF(OFFSET(PO!O$12,ROW(D88)-ROW(D$12),0)=0,\"\",OFFSET(PO!O$12,ROW(D88)-ROW(D$12),0))","v":"UN    "},{"$f":"IF($A88<>\"Serviço\",0,ROUND(SUMIF($F$9:$P$9,\"<>\",$F88:$P88),15-13*PO!$X$3))","v":1},1]
[{"$f":"OFFSET(PO!J$12,ROW(A89)-ROW($A$12),0)","v":"Serviço"},{"$f":"IF($A89=0,\"\",OFFSET(PO!K$12,ROW(B89)-ROW(B$12),0))","v":"1.8.18."},{"$f":"IF(OFFSET(PO!N$12,ROW(C89)-ROW(C$12),0)=0,\"\",OFFSET(PO!N$12,ROW(C89)-ROW(C$12),0))","v":"ELETRODUTO FLEXÍVEL CORRUGADO, PVC, DN 25 MM (3/4\"), PARA CIRCUITOS TERMINAIS, INSTALADO EM PAREDE - FORNECIMENTO E INSTALAÇÃO. AF_03/2023"},{"$f":"IF(OFFSET(PO!O$12,ROW(D89)-ROW(D$12),0)=0,\"\",OFFSET(PO!O$12,ROW(D89)-ROW(D$12),0))","v":"M"},{"$f":"IF($A89<>\"Serviço\",0,ROUND(SUMIF($F$9:$P$9,\"<>\",$F89:$P89),15-13*PO!$X$3))","v":76},76]
[{"$f":"OFFSET(PO!J$12,ROW(A90)-ROW($A$12),0)","v":"Serviço"},{"$f":"IF($A90=0,\"\",OFFSET(PO!K$12,ROW(B90)-ROW(B$12),0))","v":"1.8.19."},{"$f":"IF(OFFSET(PO!N$12,ROW(C90)-ROW(C$12),0)=0,\"\",OFFSET(PO!N$12,ROW(C90)-ROW(C$12),0))","v":"ELETRODUTO FLEXÍVEL CORRUGADO, PVC, DN 32 MM (1\"), PARA CIRCUITOS TERMINAIS, INSTALADO EM PAREDE - FORNECIMENTO E INSTALAÇÃO. AF_03/2023"},{"$f":"IF(OFFSET(PO!O$12,ROW(D90)-ROW(D$12),0)=0,\"\",OFFSET(PO!O$12,ROW(D90)-ROW(D$12),0))","v":"M"},{"$f":"IF($A90<>\"Serviço\",0,ROUND(SUMIF($F$9:$P$9,\"<>\",$F90:$P90),15-13*PO!$X$3))","v":10.199999999999999},10.199999999999999]
[{"$f":"OFFSET(PO!J$12,ROW(A91)-ROW($A$12),0)","v":"Serviço"},{"$f":"IF($A91=0,\"\",OFFSET(PO!K$12,ROW(B91)-ROW(B$12),0))","v":"1.8.20."},{"$f":"IF(OFFSET(PO!N$12,ROW(C91)-ROW(C$12),0)=0,\"\",OFFSET(PO!N$12,ROW(C91)-ROW(C$12),0))","v":"LÂMPADA COMPACTA DE LED 10 W, BASE E27 - FORNECIMENTO E INSTALAÇÃO. AF_02/2020"},{"$f":"IF(OFFSET(PO!O$12,ROW(D91)-ROW(D$12),0)=0,\"\",OFFSET(PO!O$12,ROW(D91)-ROW(D$12),0))","v":"UN"},{"$f":"IF($A91<>\"Serviço\",0,ROUND(SUMIF($F$9:$P$9,\"<>\",$F91:$P91),15-13*PO!$X$3))","v":9},9]
[{"$f":"OFFSET(PO!J$12,ROW(A92)-ROW($A$12),0)","v":"Serviço"},{"$f":"IF($A92=0,\"\",OFFSET(PO!K$12,ROW(B92)-ROW(B$12),0))","v":"1.8.21."},{"$f":"IF(OFFSET(PO!N$12,ROW(C92)-ROW(C$12),0)=0,\"\",OFFSET(PO!N$12,ROW(C92)-ROW(C$12),0))","v":"ESPELHO / PLACA DE 2 POSTOS 4\" X 2\", PARA INSTALACAO DE TOMADAS E INTERRUPTORES"},{"$f":"IF(OFFSET(PO!O$12,ROW(D92)-ROW(D$12),0)=0,\"\",OFFSET(PO!O$12,ROW(D92)-ROW(D$12),0))","v":"UN    "},{"$f":"IF($A92<>\"Serviço\",0,ROUND(SUMIF($F$9:$P$9,\"<>\",$F92:$P92),15-13*PO!$X$3))","v":7},7]
[{"$f":"OFFSET(PO!J$12,ROW(A93)-ROW($A$12),0)","v":"Serviço"},{"$f":"IF($A93=0,\"\",OFFSET(PO!K$12,ROW(B93)-ROW(B$12),0))","v":"1.8.22."},{"$f":"IF(OFFSET(PO!N$12,ROW(C93)-ROW(C$12),0)=0,\"\",OFFSET(PO!N$12,ROW(C93)-ROW(C$12),0))","v":"ESPELHO / PLACA DE 1 POSTO 4\" X 2\", PARA INSTALACAO DE TOMADAS E INTERRUPTORES"},{"$f":"IF(OFFSET(PO!O$12,ROW(D93)-ROW(D$12),0)=0,\"\",OFFSET(PO!O$12,ROW(D93)-ROW(D$12),0))","v":"UN    "},{"$f":"IF($A93<>\"Serviço\",0,ROUND(SUMIF($F$9:$P$9,\"<>\",$F93:$P93),15-13*PO!$X$3))","v":12},12]
[{"$f":"OFFSET(PO!J$12,ROW(A94)-ROW($A$12),0)","v":"Serviço"},{"$f":"IF($A94=0,\"\",OFFSET(PO!K$12,ROW(B94)-ROW(B$12),0))","v":"1.8.23."},{"$f":"IF(OFFSET(PO!N$12,ROW(C94)-ROW(C$12),0)=0,\"\",OFFSET(PO!N$12,ROW(C94)-ROW(C$12),0))","v":"QUADRO DE DISTRIBUICAO, SEM BARRAMENTO, EM PVC, DE EMBUTIR, PARA 6 DISJUNTORES NEMA OU 8 DISJUNTORES DIN"},{"$f":"IF(OFFSET(PO!O$12,ROW(D94)-ROW(D$12),0)=0,\"\",OFFSET(PO!O$12,ROW(D94)-ROW(D$12),0))","v":"UN    "},{"$f":"IF($A94<>\"Serviço\",0,ROUND(SUMIF($F$9:$P$9,\"<>\",$F94:$P94),15-13*PO!$X$3))","v":1},1]
[{"$f":"OFFSET(PO!J$12,ROW(A95)-ROW($A$12),0)","v":"Nível 2"},{"$f":"IF($A95=0,\"\",OFFSET(PO!K$12,ROW(B95)-ROW(B$12),0))","v":"1.9."},{"$f":"IF(OFFSET(PO!N$12,ROW(C95)-ROW(C$12),0)=0,\"\",OFFSET(PO!N$12,ROW(C95)-ROW(C$12),0))","v":"ISNSTALAÇÕES  HIDRÁULICAS "},{"$f":"IF(OFFSET(PO!O$12,ROW(D95)-ROW(D$12),0)=0,\"\",OFFSET(PO!O$12,ROW(D95)-ROW(D$12),0))","v":""},{"$f":"IF($A95<>\"Serviço\",0,ROUND(SUMIF($F$9:$P$9,\"<>\",$F95:$P95),15-13*PO!$X$3))","v":0}]
[{"$f":"OFFSET(PO!J$12,ROW(A96)-ROW($A$12),0)","v":"Serviço"},{"$f":"IF($A96=0,\"\",OFFSET(PO!K$12,ROW(B96)-ROW(B$12),0))","v":"1.9.1."},{"$f":"IF(OFFSET(PO!N$12,ROW(C96)-ROW(C$12),0)=0,\"\",OFFSET(PO!N$12,ROW(C96)-ROW(C$12),0))","v":"TÊ COM BUCHA DE LATÃO NA BOLSA CENTRAL, PVC, SOLDÁVEL, DN  25 MM X 3/4 , INSTALADO EM RESERVAÇÃO DE ÁGUA DE EDIFICAÇÃO QUE POSSUA RESERVATÓRIO DE FIBRA/FIBROCIMENTO   FORNECIMENTO E INSTALAÇÃO. AF_06/2016"},{"$f":"IF(OFFSET(PO!O$12,ROW(D96)-ROW(D$12),0)=0,\"\",OFFSET(PO!O$12,ROW(D96)-ROW(D$12),0))","v":"UN"},{"$f":"IF($A96<>\"Serviço\",0,ROUND(SUMIF($F$9:$P$9,\"<>\",$F96:$P96),15-13*PO!$X$3))","v":3},3]
[{"$f":"OFFSET(PO!J$12,ROW(A97)-ROW($A$12),0)","v":"Serviço"},{"$f":"IF($A97=0,\"\",OFFSET(PO!K$12,ROW(B97)-ROW(B$12),0))","v":"1.9.2."},{"$f":"IF(OFFSET(PO!N$12,ROW(C97)-ROW(C$12),0)=0,\"\",OFFSET(PO!N$12,ROW(C97)-ROW(C$12),0))","v":"TE, PVC, SOLDÁVEL, DN 32MM, INSTALADO EM RAMAL DE DISTRIBUIÇÃO DE ÁGUA - FORNECIMENTO E INSTALAÇÃO. AF_06/2022"},{"$f":"IF(OFFSET(PO!O$12,ROW(D97)-ROW(D$12),0)=0,\"\",OFFSET(PO!O$12,ROW(D97)-ROW(D$12),0))","v":"UN"},{"$f":"IF($A97<>\"Serviço\",0,ROUND(SUMIF($F$9:$P$9,\"<>\",$F97:$P97),15-13*PO!$X$3))","v":1},1]
[{"$f":"OFFSET(PO!J$12,ROW(A98)-ROW($A$12),0)","v":"Serviço"},{"$f":"IF($A98=0,\"\",OFFSET(PO!K$12,ROW(B98)-ROW(B$12),0))","v":"1.9.3."},{"$f":"IF(OFFSET(PO!N$12,ROW(C98)-ROW(C$12),0)=0,\"\",OFFSET(PO!N$12,ROW(C98)-ROW(C$12),0))","v":"TE, PVC, SOLDÁVEL, DN 25MM, INSTALADO EM RAMAL DE DISTRIBUIÇÃO DE ÁGUA - FORNECIMENTO E INSTALAÇÃO. AF_06/2022"},{"$f":"IF(OFFSET(PO!O$12,ROW(D98)-ROW(D$12),0)=0,\"\",OFFSET(PO!O$12,ROW(D98)-ROW(D$12),0))","v":"UN"},{"$f":"IF($A98<>\"Serviço\",0,ROUND(SUMIF($F$9:$P$9,\"<>\",$F98:$P98),15-13*PO!$X$3))","v":2},2]
[{"$f":"OFFSET(PO!J$12,ROW(A99)-ROW($A$12),0)","v":"Serviço"},{"$f":"IF($A99=0,\"\",OFFSET(PO!K$12,ROW(B99)-ROW(B$12),0))","v":"1.9.4."},{"$f":"IF(OFFSET(PO!N$12,ROW(C99)-ROW(C$12),0)=0,\"\",OFFSET(PO!N$12,ROW(C99)-ROW(C$12),0))","v":"LUVA COM BUCHA DE LATÃO, PVC, SOLDÁVEL, DN 25MM X 3/4 , INSTALADO EM RAMAL DE DISTRIBUIÇÃO DE ÁGUA - FORNECIMENTO E INSTALAÇÃO. AF_06/2022"},{"$f":"IF(OFFSET(PO!O$12,ROW(D99)-ROW(D$12),0)=0,\"\",OFFSET(PO!O$12,ROW(D99)-ROW(D$12),0))","v":"UN"},{"$f":"IF($A99<>\"Serviço\",0,ROUND(SUMIF($F$9:$P$9,\"<>\",$F99:$P99),15-13*PO!$X$3))","v":1},1]
[{"$f":"OFFSET(PO!J$12,ROW(A100)-ROW($A$12),0)","v":"Serviço"},{"$f":"IF($A100=0,\"\",OFFSET(PO!K$12,ROW(B100)-ROW(B$12),0))","v":"1.9.5."},{"$f":"IF(OFFSET(PO!N$12,ROW(C100)-ROW(C$12),0)=0,\"\",OFFSET(PO!N$12,ROW(C100)-ROW(C$12),0))","v":"JOELHO 90 GRAUS COM BUCHA DE LATÃO, PVC, SOLDÁVEL, DN 25MM, X 1/2  INSTALADO EM RAMAL OU SUB-RAMAL DE ÁGUA - FORNECIMENTO E INSTALAÇÃO. AF_06/2022"},{"$f":"IF(OFFSET(PO!O$12,ROW(D100)-ROW(D$12),0)=0,\"\",OFFSET(PO!O$12,ROW(D100)-ROW(D$12),0))","v":"UN"},{"$f":"IF($A100<>\"Serviço\",0,ROUND(SUMIF($F$9:$P$9,\"<>\",$F100:$P100),15-13*PO!$X$3))","v":2},2]
[{"$f":"OFFSET(PO!J$12,ROW(A101)-ROW($A$12),0)","v":"Serviço"},{"$f":"IF($A101=0,\"\",OFFSET(PO!K$12,ROW(B101)-ROW(B$12),0))","v":"1.9.6."},{"$f":"IF(OFFSET(PO!N$12,ROW(C101)-ROW(C$12),0)=0,\"\",OFFSET(PO!N$12,ROW(C101)-ROW(C$12),0))","v":"JOELHO 90 GRAUS, PVC, SOLDÁVEL, DN 32MM, INSTALADO EM RAMAL DE DISTRIBUIÇÃO DE ÁGUA - FORNECIMENTO E INSTALAÇÃO. AF_06/2022"},{"$f":"IF(OFFSET(PO!O$12,ROW(D101)-ROW(D$12),0)=0,\"\",OFFSET(PO!O$12,ROW(D101)-ROW(D$12),0))","v":"UN"},{"$f":"IF($A101<>\"Serviço\",0,ROUND(SUMIF($F$9:$P$9,\"<>\",$F101:$P101),15-13*PO!$X$3))","v":9},9]
[{"$f":"OFFSET(PO!J$12,ROW(A102)-ROW($A$12),0)","v":"Serviço"},{"$f":"IF($A102=0,\"\",OFFSET(PO!K$12,ROW(B102)-ROW(B$12),0))","v":"1.9.7."},{"$f":"IF(OFFSET(PO!N$12,ROW(C102)-ROW(C$12),0)=0,\"\",OFFSET(PO!N$12,ROW(C102)-ROW(C$12),0))","v":"JOELHO 90 GRAUS, PVC, SOLDÁVEL, DN 25MM, INSTALADO EM RAMAL DE DISTRIBUIÇÃO DE ÁGUA - FORNECIMENTO E INSTALAÇÃO. AF_06/2022"},{"$f":"IF(OFFSET(PO!O$12,ROW(D102)-ROW(D$12),0)=0,\"\",OFFSET(PO!O$12,ROW(D102)-ROW(D$12),0))","v":"UN"},{"$f":"IF($A102<>\"Serviço\",0,ROUND(SUMIF($F$9:$P$9,\"<>\",$F102:$P102),15-13*PO!$X$3))","v":6},6]
[{"$f":"OFFSET(PO!J$12,ROW(A103)-ROW($A$12),0)","v":"Serviço"},{"$f":"IF($A103=0,\"\",OFFSET(PO!K$12,ROW(B103)-ROW(B$12),0))","v":"1.9.8."},{"$f":"IF(OFFSET(PO!N$12,ROW(C103)-ROW(C$12),0)=0,\"\",OFFSET(PO!N$12,ROW(C103)-ROW(C$12),0))","v":"LUVA DE REDUÇÃO, PVC, SOLDÁVEL, DN 32MM X 25MM, INSTALADO EM PRUMADA DE ÁGUA - FORNECIMENTO E INSTALAÇÃO. AF_06/2022"},{"$f":"IF(OFFSET(PO!O$12,ROW(D103)-ROW(D$12),0)=0,\"\",OFFSET(PO!O$12,ROW(D103)-ROW(D$12),0))","v":"UN"},{"$f":"IF($A103<>\"Serviço\",0,ROUND(SUMIF($F$9:$P$9,\"<>\",$F103:$P103),15-13*PO!$X$3))","v":4},4]
[{"$f":"OFFSET(PO!J$12,ROW(A104)-ROW($A$12),0)","v":"Serviço"},{"$f":"IF($A104=0,\"\",OFFSET(PO!K$12,ROW(B104)-ROW(B$12),0))","v":"1.9.9."},{"$f":"IF(OFFSET(PO!N$12,ROW(C104)-ROW(C$12),0)=0,\"\",OFFSET(PO!N$12,ROW(C104)-ROW(C$12),0))","v":"TUBO, PVC, SOLDÁVEL, DN 25MM, INSTALADO EM RAMAL OU SUB-RAMAL DE ÁGUA - FORNECIMENTO E INSTALAÇÃO. AF_06/2022"},{"$f":"IF(OFFSET(PO!O$12,ROW(D104)-ROW(D$12),0)=0,\"\",OFFSET(PO!O$12,ROW(D104)-ROW(D$12),0))","v":"M"},{"$f":"IF($A104<>\"Serviço\",0,ROUND(SUMIF($F$9:$P$9,\"<>\",$F104:$P104),15-13*PO!$X$3))","v":18},18]
[{"$f":"OFFSET(PO!J$12,ROW(A105)-ROW($A$12),0)","v":"Serviço"},{"$f":"IF($A105=0,\"\",OFFSET(PO!K$12,ROW(B105)-ROW(B$12),0))","v":"1.9.10."},{"$f":"IF(OFFSET(PO!N$12,ROW(C105)-ROW(C$12),0)=0,\"\",OFFSET(PO!N$12,ROW(C105)-ROW(C$12),0))","v":"TUBO, PVC, SOLDÁVEL, DN 32MM, INSTALADO EM RAMAL OU SUB-RAMAL DE ÁGUA - FORNECIMENTO E INSTALAÇÃO. AF_06/2022"},{"$f":"IF(OFFSET(PO!O$12,ROW(D105)-ROW(D$12),0)=0,\"\",OFFSET(PO!O$12,ROW(D105)-ROW(D$12),0))","v":"M"},{"$f":"IF($A105<>\"Serviço\",0,ROUND(SUMIF($F$9:$P$9,\"<>\",$F105:$P105),15-13*PO!$X$3))","v":18},18]
[{"$f":"OFFSET(PO!J$12,ROW(A106)-ROW($A$12),0)","v":"Serviço"},{"$f":"IF($A106=0,\"\",OFFSET(PO!K$12,ROW(B106)-ROW(B$12),0))","v":"1.9.11."},{"$f":"IF(OFFSET(PO!N$12,ROW(C106)-ROW(C$12),0)=0,\"\",OFFSET(PO!N$12,ROW(C106)-ROW(C$12),0))","v":"REGISTRO DE PRESSÃO BRUTO, LATÃO, ROSCÁVEL, 1/2\", COM ACABAMENTO E CANOPLA CROMADOS - FORNECIMENTO E INSTALAÇÃO. AF_08/2021"},{"$f":"IF(OFFSET(PO!O$12,ROW(D106)-ROW(D$12),0)=0,\"\",OFFSET(PO!O$12,ROW(D106)-ROW(D$12),0))","v":"UN"},{"$f":"IF($A106<>\"Serviço\",0,ROUND(SUMIF($F$9:$P$9,\"<>\",$F106:$P106),15-13*PO!$X$3))","v":1},1]
[{"$f":"OFFSET(PO!J$12,ROW(A107)-ROW($A$12),0)","v":"Serviço"},{"$f":"IF($A107=0,\"\",OFFSET(PO!K$12,ROW(B107)-ROW(B$12),0))","v":"1.9.12."},{"$f":"IF(OFFSET(PO!N$12,ROW(C107)-ROW(C$12),0)=0,\"\",OFFSET(PO!N$12,ROW(C107)-ROW(C$12),0))","v":"REGISTRO DE GAVETA BRUTO, LATÃO, ROSCÁVEL, 3/4\", COM ACABAMENTO E CANOPLA CROMADOS - FORNECIMENTO E INSTALAÇÃO. AF_08/2021"},{"$f":"IF(OFFSET(PO!O$12,ROW(D107)-ROW(D$12),0)=0,\"\",OFFSET(PO!O$12,ROW(D107)-ROW(D$12),0))","v":"UN"},{"$f":"IF($A107<>\"Serviço\",0,ROUND(SUMIF($F$9:$P$9,\"<>\",$F107:$P107),15-13*PO!$X$3))","v":2},2]
[{"$f":"OFFSET(PO!J$12,ROW(A108)-ROW($A$12),0)","v":"Serviço"},{"$f":"IF($A108=0,\"\",OFFSET(PO!K$12,ROW(B108)-ROW(B$12),0))","v":"1.9.13."},{"$f":"IF(OFFSET(PO!N$12,ROW(C108)-ROW(C$12),0)=0,\"\",OFFSET(PO!N$12,ROW(C108)-ROW(C$12),0))","v":"REGISTRO DE ESFERA, PVC, SOLDÁVEL, COM VOLANTE, DN  32 MM - FORNECIMENTO E INSTALAÇÃO. AF_08/2021"},{"$f":"IF(OFFSET(PO!O$12,ROW(D108)-ROW(D$12),0)=0,\"\",OFFSET(PO!O$12,ROW(D108)-ROW(D$12),0))","v":"UN"},{"$f":"IF($A108<>\"Serviço\",0,ROUND(SUMIF($F$9:$P$9,\"<>\",$F108:$P108),15-13*PO!$X$3))","v":2},2]
[{"$f":"OFFSET(PO!J$12,ROW(A109)-ROW($A$12),0)","v":"Serviço"},{"$f":"IF($A109=0,\"\",OFFSET(PO!K$12,ROW(B109)-ROW(B$12),0))","v":"1.9.14."},{"$f":"IF(OFFSET(PO!N$12,ROW(C109)-ROW(C$12),0)=0,\"\",OFFSET(PO!N$12,ROW(C109)-ROW(C$12),0))","v":"REGISTRO DE ESFERA, PVC, SOLDÁVEL, COM VOLANTE, DN  25 MM - FORNECIMENTO E INSTALAÇÃO. AF_08/2021"},{"$f":"IF(OFFSET(PO!O$12,ROW(D109)-ROW(D$12),0)=0,\"\",OFFSET(PO!O$12,ROW(D109)-ROW(D$12),0))","v":"UN"},{"$f":"IF($A109<>\"Serviço\",0,ROUND(SUMIF($F$9:$P$9,\"<>\",$F109:$P109),15-13*PO!$X$3))","v":1},1]
[{"$f":"OFFSET(PO!J$12,ROW(A110)-ROW($A$12),0)","v":"Serviço"},{"$f":"IF($A110=0,\"\",OFFSET(PO!K$12,ROW(B110)-ROW(B$12),0))","v":"1.9.15."},{"$f":"IF(OFFSET(PO!N$12,ROW(C110)-ROW(C$12),0)=0,\"\",OFFSET(PO!N$12,ROW(C110)-ROW(C$12),0))","v":"CHUVEIRO ELÉTRICO COMUM CORPO PLÁSTICO, TIPO DUCHA \u0096 FORNECIMENTO E INSTALAÇÃO. AF_01/2020"},{"$f":"IF(OFFSET(PO!O$12,ROW(D110)-ROW(D$12),0)=0,\"\",OFFSET(PO!O$12,ROW(D110)-ROW(D$12),0))","v":"UN"},{"$f":"IF($A110<>\"Serviço\",0,ROUND(SUMIF($F$9:$P$9,\"<>\",$F110:$P110),15-13*PO!$X$3))","v":1},1]
[{"$f":"OFFSET(PO!J$12,ROW(A111)-ROW($A$12),0)","v":"Serviço"},{"$f":"IF($A111=0,\"\",OFFSET(PO!K$12,ROW(B111)-ROW(B$12),0))","v":"1.9.16."},{"$f":"IF(OFFSET(PO!N$12,ROW(C111)-ROW(C$12),0)=0,\"\",OFFSET(PO!N$12,ROW(C111)-ROW(C$12),0))","v":"TORNEIRA DE BOIA PARA CAIXA D'ÁGUA, ROSCÁVEL, 1/2\" - FORNECIMENTO E INSTALAÇÃO. AF_08/2021"},{"$f":"IF(OFFSET(PO!O$12,ROW(D111)-ROW(D$12),0)=0,\"\",OFFSET(PO!O$12,ROW(D111)-ROW(D$12),0))","v":"UN"},{"$f":"IF($A111<>\"Serviço\",0,ROUND(SUMIF($F$9:$P$9,\"<>\",$F111:$P111),15-13*PO!$X$3))","v":1},1]
[{"$f":"OFFSET(PO!J$12,ROW(A112)-ROW($A$12),0)","v":"Serviço"},{"$f":"IF($A112=0,\"\",OFFSET(PO!K$12,ROW(B112)-ROW(B$12),0))","v":"1.9.17."},{"$f":"IF(OFFSET(PO!N$12,ROW(C112)-ROW(C$12),0)=0,\"\",OFFSET(PO!N$12,ROW(C112)-ROW(C$12),0))","v":"TORNEIRA DE MESA/BANCADA, PARA LAVATORIO, FIXA, METALICA CROMADA, PADRAO POPULAR, 1/2 \" OU 3/4 \" (REF 1193)"},{"$f":"IF(OFFSET(PO!O$12,ROW(D112)-ROW(D$12),0)=0,\"\",OFFSET(PO!O$12,ROW(D112)-ROW(D$12),0))","v":"UN    "},{"$f":"IF($A112<>\"Serviço\",0,ROUND(SUMIF($F$9:$P$9,\"<>\",$F112:$P112),15-13*PO!$X$3))","v":1},1]
[{"$f":"OFFSET(PO!J$12,ROW(A113)-ROW($A$12),0)","v":"Serviço"},{"$f":"IF($A113=0,\"\",OFFSET(PO!K$12,ROW(B113)-ROW(B$12),0))","v":"1.9.18."},{"$f":"IF(OFFSET(PO!N$12,ROW(C113)-ROW(C$12),0)=0,\"\",OFFSET(PO!N$12,ROW(C113)-ROW(C$12),0))","v":"CAIXA D´ÁGUA EM POLIETILENO, 500 LITROS - FORNECIMENTO E INSTALAÇÃO. AF_06/2021"},{"$f":"IF(OFFSET(PO!O$12,ROW(D113)-ROW(D$12),0)=0,\"\",OFFSET(PO!O$12,ROW(D113)-ROW(D$12),0))","v":"UN"},{"$f":"IF($A113<>\"Serviço\",0,ROUND(SUMIF($F$9:$P$9,\"<>\",$F113:$P113),15-13*PO!$X$3))","v":1},1]
[{"$f":"OFFSET(PO!J$12,ROW(A114)-ROW($A$12),0)","v":"Serviço"},{"$f":"IF($A114=0,\"\",OFFSET(PO!K$12,ROW(B114)-ROW(B$12),0))","v":"1.9.19."},{"$f":"IF(OFFSET(PO!N$12,ROW(C114)-ROW(C$12),0)=0,\"\",OFFSET(PO!N$12,ROW(C114)-ROW(C$12),0))","v":"ADAPTADOR COM FLANGES LIVRES, PVC, SOLDÁVEL LONGO, DN 32 MM X 1 , INSTALADO EM RESERVAÇÃO DE ÁGUA DE EDIFICAÇÃO QUE POSSUA RESERVATÓRIO DE FIBRA/FIBROCIMENTO   FORNECIMENTO E INSTALAÇÃO. AF_06/2016"},{"$f":"IF(OFFSET(PO!O$12,ROW(D114)-ROW(D$12),0)=0,\"\",OFFSET(PO!O$12,ROW(D114)-ROW(D$12),0))","v":"UN"},{"$f":"IF($A114<>\"Serviço\",0,ROUND(SUMIF($F$9:$P$9,\"<>\",$F114:$P114),15-13*PO!$X$3))","v":3},3]
[{"$f":"OFFSET(PO!J$12,ROW(A115)-ROW($A$12),0)","v":"Serviço"},{"$f":"IF($A115=0,\"\",OFFSET(PO!K$12,ROW(B115)-ROW(B$12),0))","v":"1.9.20."},{"$f":"IF(OFFSET(PO!N$12,ROW(C115)-ROW(C$12),0)=0,\"\",OFFSET(PO!N$12,ROW(C115)-ROW(C$12),0))","v":"ADAPTADOR CURTO COM BOLSA E ROSCA PARA REGISTRO, PVC, SOLDÁVEL, DN 32MM X 1 , INSTALADO EM RAMAL OU SUB-RAMAL DE ÁGUA - FORNECIMENTO E INSTALAÇÃO. AF_06/2022"},{"$f":"IF(OFFSET(PO!O$12,ROW(D115)-ROW(D$12),0)=0,\"\",OFFSET(PO!O$12,ROW(D115)-ROW(D$12),0))","v":"UN"},{"$f":"IF($A115<>\"Serviço\",0,ROUND(SUMIF($F$9:$P$9,\"<>\",$F115:$P115),15-13*PO!$X$3))","v":4},4]
[{"$f":"OFFSET(PO!J$12,ROW(A116)-ROW($A$12),0)","v":"Serviço"},{"$f":"IF($A116=0,\"\",OFFSET(PO!K$12,ROW(B116)-ROW(B$12),0))","v":"1.9.21."},{"$f":"IF(OFFSET(PO!N$12,ROW(C116)-ROW(C$12),0)=0,\"\",OFFSET(PO!N$12,ROW(C116)-ROW(C$12),0))","v":"ADAPTADOR CURTO COM BOLSA E ROSCA PARA REGISTRO, PVC, SOLDÁVEL, DN 25MM X 3/4 , INSTALADO EM RAMAL OU SUB-RAMAL DE ÁGUA - FORNECIMENTO E INSTALAÇÃO. AF_06/2022"},{"$f":"IF(OFFSET(PO!O$12,ROW(D116)-ROW(D$12),0)=0,\"\",OFFSET(PO!O$12,ROW(D116)-ROW(D$12),0))","v":"UN"},{"$f":"IF($A116<>\"Serviço\",0,ROUND(SUMIF($F$9:$P$9,\"<>\",$F116:$P116),15-13*PO!$X$3))","v":6},6]
[{"$f":"OFFSET(PO!J$12,ROW(A117)-ROW($A$12),0)","v":"Nível 2"},{"$f":"IF($A117=0,\"\",OFFSET(PO!K$12,ROW(B117)-ROW(B$12),0))","v":"1.10."},{"$f":"IF(OFFSET(PO!N$12,ROW(C117)-ROW(C$12),0)=0,\"\",OFFSET(PO!N$12,ROW(C117)-ROW(C$12),0))","v":"INSTALAÇÕES SANITÁRIAS"},{"$f":"IF(OFFSET(PO!O$12,ROW(D117)-ROW(D$12),0)=0,\"\",OFFSET(PO!O$12,ROW(D117)-ROW(D$12),0))","v":""},{"$f":"IF($A117<>\"Serviço\",0,ROUND(SUMIF($F$9:$P$9,\"<>\",$F117:$P117),15-13*PO!$X$3))","v":0}]
[{"$f":"OFFSET(PO!J$12,ROW(A118)-ROW($A$12),0)","v":"Serviço"},{"$f":"IF($A118=0,\"\",OFFSET(PO!K$12,ROW(B118)-ROW(B$12),0))","v":"1.10.1."},{"$f":"IF(OFFSET(PO!N$12,ROW(C118)-ROW(C$12),0)=0,\"\",OFFSET(PO!N$12,ROW(C118)-ROW(C$12),0))","v":"TE, PVC, SERIE NORMAL, ESGOTO PREDIAL, DN 100 X 100 MM, JUNTA ELÁSTICA, FORNECIDO E INSTALADO EM RAMAL DE DESCARGA OU RAMAL DE ESGOTO SANITÁRIO. AF_08/2022"},{"$f":"IF(OFFSET(PO!O$12,ROW(D118)-ROW(D$12),0)=0,\"\",OFFSET(PO!O$12,ROW(D118)-ROW(D$12),0))","v":"UN"},{"$f":"IF($A118<>\"Serviço\",0,ROUND(SUMIF($F$9:$P$9,\"<>\",$F118:$P118),15-13*PO!$X$3))","v":1},1]
[{"$f":"OFFSET(PO!J$12,ROW(A119)-ROW($A$12),0)","v":"Serviço"},{"$f":"IF($A119=0,\"\",OFFSET(PO!K$12,ROW(B119)-ROW(B$12),0))","v":"1.10.2."},{"$f":"IF(OFFSET(PO!N$12,ROW(C119)-ROW(C$12),0)=0,\"\",OFFSET(PO!N$12,ROW(C119)-ROW(C$12),0))","v":"TE SANITARIO DE REDUCAO, PVC, DN 100 X 50 MM, SERIE NORMAL, PARA ESGOTO PREDIAL"},{"$f":"IF(OFFSET(PO!O$12,ROW(D119)-ROW(D$12),0)=0,\"\",OFFSET(PO!O$12,ROW(D119)-ROW(D$12),0))","v":"UN    "},{"$f":"IF($A119<>\"Serviço\",0,ROUND(SUMIF($F$9:$P$9,\"<>\",$F119:$P119),15-13*PO!$X$3))","v":1},1]
[{"$f":"OFFSET(PO!J$12,ROW(A120)-ROW($A$12),0)","v":"Serviço"},{"$f":"IF($A120=0,\"\",OFFSET(PO!K$12,ROW(B120)-ROW(B$12),0))","v":"1.10.3."},{"$f":"IF(OFFSET(PO!N$12,ROW(C120)-ROW(C$12),0)=0,\"\",OFFSET(PO!N$12,ROW(C120)-ROW(C$12),0))","v":"TE, PVC, SERIE NORMAL, ESGOTO PREDIAL, DN 75 X 75 MM, JUNTA ELÁSTICA, FORNECIDO E INSTALADO EM RAMAL DE DESCARGA OU RAMAL DE ESGOTO SANITÁRIO. AF_08/2022"},{"$f":"IF(OFFSET(PO!O$12,ROW(D120)-ROW(D$12),0)=0,\"\",OFFSET(PO!O$12,ROW(D120)-ROW(D$12),0))","v":"UN"},{"$f":"IF($A120<>\"Serviço\",0,ROUND(SUMIF($F$9:$P$9,\"<>\",$F120:$P120),15-13*PO!$X$3))","v":1},1]
[{"$f":"OFFSET(PO!J$12,ROW(A121)-ROW($A$12),0)","v":"Serviço"},{"$f":"IF($A121=0,\"\",OFFSET(PO!K$12,ROW(B121)-ROW(B$12),0))","v":"1.10.4."},{"$f":"IF(OFFSET(PO!N$12,ROW(C121)-ROW(C$12),0)=0,\"\",OFFSET(PO!N$12,ROW(C121)-ROW(C$12),0))","v":"LUVA SIMPLES, PVC, SERIE NORMAL, ESGOTO PREDIAL, DN 100 MM, JUNTA ELÁSTICA, FORNECIDO E INSTALADO EM RAMAL DE DESCARGA OU RAMAL DE ESGOTO SANITÁRIO. AF_08/2022"},{"$f":"IF(OFFSET(PO!O$12,ROW(D121)-ROW(D$12),0)=0,\"\",OFFSET(PO!O$12,ROW(D121)-ROW(D$12),0))","v":"UN"},{"$f":"IF($A121<>\"Serviço\",0,ROUND(SUMIF($F$9:$P$9,\"<>\",$F121:$P121),15-13*PO!$X$3))","v":16},16]
[{"$f":"OFFSET(PO!J$12,ROW(A122)-ROW($A$12),0)","v":"Serviço"},{"$f":"IF($A122=0,\"\",OFFSET(PO!K$12,ROW(B122)-ROW(B$12),0))","v":"1.10.5."},{"$f":"IF(OFFSET(PO!N$12,ROW(C122)-ROW(C$12),0)=0,\"\",OFFSET(PO!N$12,ROW(C122)-ROW(C$12),0))","v":"LUVA SIMPLES, PVC, SERIE NORMAL, ESGOTO PREDIAL, DN 75 MM, JUNTA ELÁSTICA, FORNECIDO E INSTALADO EM RAMAL DE DESCARGA OU RAMAL DE ESGOTO SANITÁRIO. AF_08/2022"},{"$f":"IF(OFFSET(PO!O$12,ROW(D122)-ROW(D$12),0)=0,\"\",OFFSET(PO!O$12,ROW(D122)-ROW(D$12),0))","v":"UN"},{"$f":"IF($A122<>\"Serviço\",0,ROUND(SUMIF($F$9:$P$9,\"<>\",$F122:$P122),15-13*PO!$X$3))","v":5},5]
[{"$f":"OFFSET(PO!J$12,ROW(A123)-ROW($A$12),0)","v":"Serviço"},{"$f":"IF($A123=0,\"\",OFFSET(PO!K$12,ROW(B123)-ROW(B$12),0))","v":"1.10.6."},{"$f":"IF(OFFSET(PO!N$12,ROW(C123)-ROW(C$12),0)=0,\"\",OFFSET(PO!N$12,ROW(C123)-ROW(C$12),0))","v":"LUVA SIMPLES, PVC, SERIE NORMAL, ESGOTO PREDIAL, DN 50 MM, JUNTA ELÁSTICA, FORNECIDO E INSTALADO EM RAMAL DE DESCARGA OU RAMAL DE ESGOTO SANITÁRIO. AF_08/2022"},{"$f":"IF(OFFSET(PO!O$12,ROW(D123)-ROW(D$12),0)=0,\"\",OFFSET(PO!O$12,ROW(D123)-ROW(D$12),0))","v":"UN"},{"$f":"IF($A123<>\"Serviço\",0,ROUND(SUMIF($F$9:$P$9,\"<>\",$F123:$P123),15-13*PO!$X$3))","v":10},10]
[{"$f":"OFFSET(PO!J$12,ROW(A124)-ROW($A$12),0)","v":"Serviço"},{"$f":"IF($A124=0,\"\",OFFSET(PO!K$12,ROW(B124)-ROW(B$12),0))","v":"1.10.7."},{"$f":"IF(OFFSET(PO!N$12,ROW(C124)-ROW(C$12),0)=0,\"\",OFFSET(PO!N$12,ROW(C124)-ROW(C$12),0))","v":"JUNÇÃO SIMPLES, PVC, SERIE NORMAL, ESGOTO PREDIAL, DN 50 X 50 MM, JUNTA ELÁSTICA, FORNECIDO E INSTALADO EM RAMAL DE DESCARGA OU RAMAL DE ESGOTO SANITÁRIO. AF_08/2022"},{"$f":"IF(OFFSET(PO!O$12,ROW(D124)-ROW(D$12),0)=0,\"\",OFFSET(PO!O$12,ROW(D124)-ROW(D$12),0))","v":"UN"},{"$f":"IF($A124<>\"Serviço\",0,ROUND(SUMIF($F$9:$P$9,\"<>\",$F124:$P124),15-13*PO!$X$3))","v":1},1]
[{"$f":"OFFSET(PO!J$12,ROW(A125)-ROW($A$12),0)","v":"Serviço"},{"$f":"IF($A125=0,\"\",OFFSET(PO!K$12,ROW(B125)-ROW(B$12),0))","v":"1.10.8."},{"$f":"IF(OFFSET(PO!N$12,ROW(C125)-ROW(C$12),0)=0,\"\",OFFSET(PO!N$12,ROW(C125)-ROW(C$12),0))","v":"JOELHO 90 GRAUS, PVC, SERIE NORMAL, ESGOTO PREDIAL, DN 100 MM, JUNTA ELÁSTICA, FORNECIDO E INSTALADO EM RAMAL DE DESCARGA OU RAMAL DE ESGOTO SANITÁRIO. AF_08/2022"},{"$f":"IF(OFFSET(PO!O$12,ROW(D125)-ROW(D$12),0)=0,\"\",OFFSET(PO!O$12,ROW(D125)-ROW(D$12),0))","v":"UN"},{"$f":"IF($A125<>\"Serviço\",0,ROUND(SUMIF($F$9:$P$9,\"<>\",$F125:$P125),15-13*PO!$X$3))","v":1},1]
[{"$f":"OFFSET(PO!J$12,ROW(A126)-ROW($A$12),0)","v":"Serviço"},{"$f":"IF($A126=0,\"\",OFFSET(PO!K$12,ROW(B126)-ROW(B$12),0))","v":"1.10.9."},{"$f":"IF(OFFSET(PO!N$12,ROW(C126)-ROW(C$12),0)=0,\"\",OFFSET(PO!N$12,ROW(C126)-ROW(C$12),0))","v":"JOELHO 90 GRAUS, PVC, SERIE NORMAL, ESGOTO PREDIAL, DN 50 MM, JUNTA ELÁSTICA, FORNECIDO E INSTALADO EM RAMAL DE DESCARGA OU RAMAL DE ESGOTO SANITÁRIO. AF_08/2022"},{"$f":"IF(OFFSET(PO!O$12,ROW(D126)-ROW(D$12),0)=0,\"\",OFFSET(PO!O$12,ROW(D126)-ROW(D$12),0))","v":"UN"},{"$f":"IF($A126<>\"Serviço\",0,ROUND(SUMIF($F$9:$P$9,\"<>\",$F126:$P126),15-13*PO!$X$3))","v":13},13]
[{"$f":"OFFSET(PO!J$12,ROW(A127)-ROW($A$12),0)","v":"Serviço"},{"$f":"IF($A127=0,\"\",OFFSET(PO!K$12,ROW(B127)-ROW(B$12),0))","v":"1.10.10."},{"$f":"IF(OFFSET(PO!N$12,ROW(C127)-ROW(C$12),0)=0,\"\",OFFSET(PO!N$12,ROW(C127)-ROW(C$12),0))","v":"JOELHO 90 GRAUS, PVC, SERIE NORMAL, ESGOTO PREDIAL, DN 40 MM, JUNTA SOLDÁVEL, FORNECIDO E INSTALADO EM RAMAL DE DESCARGA OU RAMAL DE ESGOTO SANITÁRIO. AF_08/2022"},{"$f":"IF(OFFSET(PO!O$12,ROW(D127)-ROW(D$12),0)=0,\"\",OFFSET(PO!O$12,ROW(D127)-ROW(D$12),0))","v":"UN"},{"$f":"IF($A127<>\"Serviço\",0,ROUND(SUMIF($F$9:$P$9,\"<>\",$F127:$P127),15-13*PO!$X$3))","v":6},6]
[{"$f":"OFFSET(PO!J$12,ROW(A128)-ROW($A$12),0)","v":"Serviço"},{"$f":"IF($A128=0,\"\",OFFSET(PO!K$12,ROW(B128)-ROW(B$12),0))","v":"1.10.11."},{"$f":"IF(OFFSET(PO!N$12,ROW(C128)-ROW(C$12),0)=0,\"\",OFFSET(PO!N$12,ROW(C128)-ROW(C$12),0))","v":"JOELHO 45 GRAUS, PVC, SERIE NORMAL, ESGOTO PREDIAL, DN 100 MM, JUNTA ELÁSTICA, FORNECIDO E INSTALADO EM RAMAL DE DESCARGA OU RAMAL DE ESGOTO SANITÁRIO. AF_08/2022"},{"$f":"IF(OFFSET(PO!O$12,ROW(D128)-ROW(D$12),0)=0,\"\",OFFSET(PO!O$12,ROW(D128)-ROW(D$12),0))","v":"UN"},{"$f":"IF($A128<>\"Serviço\",0,ROUND(SUMIF($F$9:$P$9,\"<>\",$F128:$P128),15-13*PO!$X$3))","v":8},8]
[{"$f":"OFFSET(PO!J$12,ROW(A129)-ROW($A$12),0)","v":"Serviço"},{"$f":"IF($A129=0,\"\",OFFSET(PO!K$12,ROW(B129)-ROW(B$12),0))","v":"1.10.12."},{"$f":"IF(OFFSET(PO!N$12,ROW(C129)-ROW(C$12),0)=0,\"\",OFFSET(PO!N$12,ROW(C129)-ROW(C$12),0))","v":"JOELHO 45 GRAUS, PVC, SERIE NORMAL, ESGOTO PREDIAL, DN 75 MM, JUNTA ELÁSTICA, FORNECIDO E INSTALADO EM RAMAL DE DESCARGA OU RAMAL DE ESGOTO SANITÁRIO. AF_08/2022"},{"$f":"IF(OFFSET(PO!O$12,ROW(D129)-ROW(D$12),0)=0,\"\",OFFSET(PO!O$12,ROW(D129)-ROW(D$12),0))","v":"UN"},{"$f":"IF($A129<>\"Serviço\",0,ROUND(SUMIF($F$9:$P$9,\"<>\",$F129:$P129),15-13*PO!$X$3))","v":3},3]
[{"$f":"OFFSET(PO!J$12,ROW(A130)-ROW($A$12),0)","v":"Serviço"},{"$f":"IF($A130=0,\"\",OFFSET(PO!K$12,ROW(B130)-ROW(B$12),0))","v":"1.10.13."},{"$f":"IF(OFFSET(PO!N$12,ROW(C130)-ROW(C$12),0)=0,\"\",OFFSET(PO!N$12,ROW(C130)-ROW(C$12),0))","v":"JOELHO 45 GRAUS, PVC, SERIE NORMAL, ESGOTO PREDIAL, DN 50 MM, JUNTA ELÁSTICA, FORNECIDO E INSTALADO EM RAMAL DE DESCARGA OU RAMAL DE ESGOTO SANITÁRIO. AF_08/2022"},{"$f":"IF(OFFSET(PO!O$12,ROW(D130)-ROW(D$12),0)=0,\"\",OFFSET(PO!O$12,ROW(D130)-ROW(D$12),0))","v":"UN"},{"$f":"IF($A130<>\"Serviço\",0,ROUND(SUMIF($F$9:$P$9,\"<>\",$F130:$P130),15-13*PO!$X$3))","v":2},2]
[{"$f":"OFFSET(PO!J$12,ROW(A131)-ROW($A$12),0)","v":"Serviço"},{"$f":"IF($A131=0,\"\",OFFSET(PO!K$12,ROW(B131)-ROW(B$12),0))","v":"1.10.14."},{"$f":"IF(OFFSET(PO!N$12,ROW(C131)-ROW(C$12),0)=0,\"\",OFFSET(PO!N$12,ROW(C131)-ROW(C$12),0))","v":"JOELHO 45 GRAUS, PVC, SERIE NORMAL, ESGOTO PREDIAL, DN 40 MM, JUNTA SOLDÁVEL, FORNECIDO E INSTALADO EM RAMAL DE DESCARGA OU RAMAL DE ESGOTO SANITÁRIO. AF_08/2022"},{"$f":"IF(OFFSET(PO!O$12,ROW(D131)-ROW(D$12),0)=0,\"\",OFFSET(PO!O$12,ROW(D131)-ROW(D$12),0))","v":"UN"},{"$f":"IF($A131<>\"Serviço\",0,ROUND(SUMIF($F$9:$P$9,\"<>\",$F131:$P131),15-13*PO!$X$3))","v":1},1]
[{"$f":"OFFSET(PO!J$12,ROW(A132)-ROW($A$12),0)","v":"Serviço"},{"$f":"IF($A132=0,\"\",OFFSET(PO!K$12,ROW(B132)-ROW(B$12),0))","v":"1.10.15."},{"$f":"IF(OFFSET(PO!N$12,ROW(C132)-ROW(C$12),0)=0,\"\",OFFSET(PO!N$12,ROW(C132)-ROW(C$12),0))","v":"TUBO PVC, SERIE NORMAL, ESGOTO PREDIAL, DN 40 MM, FORNECIDO E INSTALADO EM RAMAL DE DESCARGA OU RAMAL DE ESGOTO SANITÁRIO. AF_08/2022"},{"$f":"IF(OFFSET(PO!O$12,ROW(D132)-ROW(D$12),0)=0,\"\",OFFSET(PO!O$12,ROW(D132)-ROW(D$12),0))","v":"M"},{"$f":"IF($A132<>\"Serviço\",0,ROUND(SUMIF($F$9:$P$9,\"<>\",$F132:$P132),15-13*PO!$X$3))","v":6},6]
[{"$f":"OFFSET(PO!J$12,ROW(A133)-ROW($A$12),0)","v":"Serviço"},{"$f":"IF($A133=0,\"\",OFFSET(PO!K$12,ROW(B133)-ROW(B$12),0))","v":"1.10.16."},{"$f":"IF(OFFSET(PO!N$12,ROW(C133)-ROW(C$12),0)=0,\"\",OFFSET(PO!N$12,ROW(C133)-ROW(C$12),0))","v":"TUBO PVC, SERIE NORMAL, ESGOTO PREDIAL, DN 50 MM, FORNECIDO E INSTALADO EM RAMAL DE DESCARGA OU RAMAL DE ESGOTO SANITÁRIO. AF_08/2022"},{"$f":"IF(OFFSET(PO!O$12,ROW(D133)-ROW(D$12),0)=0,\"\",OFFSET(PO!O$12,ROW(D133)-ROW(D$12),0))","v":"M"},{"$f":"IF($A133<>\"Serviço\",0,ROUND(SUMIF($F$9:$P$9,\"<>\",$F133:$P133),15-13*PO!$X$3))","v":6},6]
[{"$f":"OFFSET(PO!J$12,ROW(A134)-ROW($A$12),0)","v":"Serviço"},{"$f":"IF($A134=0,\"\",OFFSET(PO!K$12,ROW(B134)-ROW(B$12),0))","v":"1.10.17."},{"$f":"IF(OFFSET(PO!N$12,ROW(C134)-ROW(C$12),0)=0,\"\",OFFSET(PO!N$12,ROW(C134)-ROW(C$12),0))","v":"TUBO PVC, SERIE NORMAL, ESGOTO PREDIAL, DN 75 MM, FORNECIDO E INSTALADO EM RAMAL DE DESCARGA OU RAMAL DE ESGOTO SANITÁRIO. AF_08/2022"},{"$f":"IF(OFFSET(PO!O$12,ROW(D134)-ROW(D$12),0)=0,\"\",OFFSET(PO!O$12,ROW(D134)-ROW(D$12),0))","v":"M"},{"$f":"IF($A134<>\"Serviço\",0,ROUND(SUMIF($F$9:$P$9,\"<>\",$F134:$P134),15-13*PO!$X$3))","v":6},6]
[{"$f":"OFFSET(PO!J$12,ROW(A135)-ROW($A$12),0)","v":"Serviço"},{"$f":"IF($A135=0,\"\",OFFSET(PO!K$12,ROW(B135)-ROW(B$12),0))","v":"1.10.18."},{"$f":"IF(OFFSET(PO!N$12,ROW(C135)-ROW(C$12),0)=0,\"\",OFFSET(PO!N$12,ROW(C135)-ROW(C$12),0))","v":"TUBO PVC, SERIE NORMAL, ESGOTO PREDIAL, DN 100 MM, FORNECIDO E INSTALADO EM RAMAL DE DESCARGA OU RAMAL DE ESGOTO SANITÁRIO. AF_08/2022"},{"$f":"IF(OFFSET(PO!O$12,ROW(D135)-ROW(D$12),0)=0,\"\",OFFSET(PO!O$12,ROW(D135)-ROW(D$12),0))","v":"M"},{"$f":"IF($A135<>\"Serviço\",0,ROUND(SUMIF($F$9:$P$9,\"<>\",$F135:$P135),15-13*PO!$X$3))","v":15},15]
[{"$f":"OFFSET(PO!J$12,ROW(A136)-ROW($A$12),0)","v":"Serviço"},{"$f":"IF($A136=0,\"\",OFFSET(PO!K$12,ROW(B136)-ROW(B$12),0))","v":"1.10.19."},{"$f":"IF(OFFSET(PO!N$12,ROW(C136)-ROW(C$12),0)=0,\"\",OFFSET(PO!N$12,ROW(C136)-ROW(C$12),0))","v":"VASO SANITÁRIO SIFONADO COM CAIXA ACOPLADA LOUÇA BRANCA, INCLUSO ENGATE FLEXÍVEL EM PLÁSTICO BRANCO, 1/2  X 40CM - FORNECIMENTO E INSTALAÇÃO. AF_01/2020"},{"$f":"IF(OFFSET(PO!O$12,ROW(D136)-ROW(D$12),0)=0,\"\",OFFSET(PO!O$12,ROW(D136)-ROW(D$12),0))","v":"UN"},{"$f":"IF($A136<>\"Serviço\",0,ROUND(SUMIF($F$9:$P$9,\"<>\",$F136:$P136),15-13*PO!$X$3))","v":1},1]
[{"$f":"OFFSET(PO!J$12,ROW(A137)-ROW($A$12),0)","v":"Serviço"},{"$f":"IF($A137=0,\"\",OFFSET(PO!K$12,ROW(B137)-ROW(B$12),0))","v":"1.10.20."},{"$f":"IF(OFFSET(PO!N$12,ROW(C137)-ROW(C$12),0)=0,\"\",OFFSET(PO!N$12,ROW(C137)-ROW(C$12),0))","v":"ASSENTO SANITARIO DE PLASTICO, TIPO CONVENCIONAL"},{"$f":"IF(OFFSET(PO!O$12,ROW(D137)-ROW(D$12),0)=0,\"\",OFFSET(PO!O$12,ROW(D137)-ROW(D$12),0))","v":"UN    "},{"$f":"IF($A137<>\"Serviço\",0,ROUND(SUMIF($F$9:$P$9,\"<>\",$F137:$P137),15-13*PO!$X$3))","v":1},1]
[{"$f":"OFFSET(PO!J$12,ROW(A138)-ROW($A$12),0)","v":"Serviço"},{"$f":"IF($A138=0,\"\",OFFSET(PO!K$12,ROW(B138)-ROW(B$12),0))","v":"1.10.21."},{"$f":"IF(OFFSET(PO!N$12,ROW(C138)-ROW(C$12),0)=0,\"\",OFFSET(PO!N$12,ROW(C138)-ROW(C$12),0))","v":"LAVATÓRIO LOUÇA BRANCA SUSPENSO, 29,5 X 39CM OU EQUIVALENTE, PADRÃO POPULAR, INCLUSO SIFÃO FLEXÍVEL EM PVC, VÁLVULA E ENGATE FLEXÍVEL 30CM EM PLÁSTICO E TORNEIRA CROMADA DE MESA, PADRÃO POPULAR - FORNECIMENTO E INSTALAÇÃO. AF_01/2020"},{"$f":"IF(OFFSET(PO!O$12,ROW(D138)-ROW(D$12),0)=0,\"\",OFFSET(PO!O$12,ROW(D138)-ROW(D$12),0))","v":"UN"},{"$f":"IF($A138<>\"Serviço\",0,ROUND(SUMIF($F$9:$P$9,\"<>\",$F138:$P138),15-13*PO!$X$3))","v":1},1]
[{"$f":"OFFSET(PO!J$12,ROW(A139)-ROW($A$12),0)","v":"Serviço"},{"$f":"IF($A139=0,\"\",OFFSET(PO!K$12,ROW(B139)-ROW(B$12),0))","v":"1.10.22."},{"$f":"IF(OFFSET(PO!N$12,ROW(C139)-ROW(C$12),0)=0,\"\",OFFSET(PO!N$12,ROW(C139)-ROW(C$12),0))","v":"CAIXA DE GORDURA PEQUENA (CAPACIDADE: 19 L), CIRCULAR, EM PVC, DIÂMETRO INTERNO= 0,3 M. AF_12/2020"},{"$f":"IF(OFFSET(PO!O$12,ROW(D139)-ROW(D$12),0)=0,\"\",OFFSET(PO!O$12,ROW(D139)-ROW(D$12),0))","v":"UN"},{"$f":"IF($A139<>\"Serviço\",0,ROUND(SUMIF($F$9:$P$9,\"<>\",$F139:$P139),15-13*PO!$X$3))","v":1},1]
[{"$f":"OFFSET(PO!J$12,ROW(A140)-ROW($A$12),0)","v":"Serviço"},{"$f":"IF($A140=0,\"\",OFFSET(PO!K$12,ROW(B140)-ROW(B$12),0))","v":"1.10.23."},{"$f":"IF(OFFSET(PO!N$12,ROW(C140)-ROW(C$12),0)=0,\"\",OFFSET(PO!N$12,ROW(C140)-ROW(C$12),0))","v":"CAIXA SIFONADA, PVC, DN 100 X 100 X 50 MM, JUNTA ELÁSTICA, FORNECIDA E INSTALADA EM RAMAL DE DESCARGA OU EM RAMAL DE ESGOTO SANITÁRIO. AF_08/2022"},{"$f":"IF(OFFSET(PO!O$12,ROW(D140)-ROW(D$12),0)=0,\"\",OFFSET(PO!O$12,ROW(D140)-ROW(D$12),0))","v":"UN"},{"$f":"IF($A140<>\"Serviço\",0,ROUND(SUMIF($F$9:$P$9,\"<>\",$F140:$P140),15-13*PO!$X$3))","v":1},1]
[{"$f":"OFFSET(PO!J$12,ROW(A141)-ROW($A$12),0)","v":"Serviço"},{"$f":"IF($A141=0,\"\",OFFSET(PO!K$12,ROW(B141)-ROW(B$12),0))","v":"1.10.24."},{"$f":"IF(OFFSET(PO!N$12,ROW(C141)-ROW(C$12),0)=0,\"\",OFFSET(PO!N$12,ROW(C141)-ROW(C$12),0))","v":"TANQUE SEPTICO CAP-1875 LITROS DE CONCRETO"},{"$f":"IF(OFFSET(PO!O$12,ROW(D141)-ROW(D$12),0)=0,\"\",OFFSET(PO!O$12,ROW(D141)-ROW(D$12),0))","v":"UNIDADE"},{"$f":"IF($A141<>\"Serviço\",0,ROUND(SUMIF($F$9:$P$9,\"<>\",$F141:$P141),15-13*PO!$X$3))","v":1},1]
[]
[]
[null,{"$f":"PO!$K$153","v":"SÃO JOÃO DA URTIGA/RS"}]
[null,"Local"]
[]
[null,{"$f":"PO!$K$156","v":"2023-06-06"}]
[null,"Data"]

{"sheet":"CFF","index":4,"n_rows":57,"n_cols":29,"rows_kept":57,"cut":false,"hidden":false,"merged":[[47,11,49,11],[47,12,49,12],[47,13,49,13],[41,11,43,11],[41,12,43,12],[41,13,43,13],[44,11,46,11],[44,12,46,12],[44,13,46,13],[35,12,37,12],[35,13,37,13],[38,11,40,11],[38,12,40,12],[38,13,40,13],[55,11,55,13],[10,11,12,11],[10,12,12,12],[13,11,16,12],[13,13,16,13],[17,11,19,11],[20,11,22,11],[20,12,22,12],[20,13,22,13],[23,11,25,11],[23,12,25,12],[23,13,25,13],[26,11,28,11],[26,12,28,12],[26,13,28,13],[29,11,31,11],[7,11,7,12],[10,13,12,13],[17,12,19,12],[17,13,19,13],[54,16,54,18],[54,12,54,13],[53,16,53,18],[52,16,52,18],[52,11,52,13],[53,12,53,13],[29,12,31,12],[29,13,31,13],[32,11,34,11],[32,12,34,12],[32,13,34,13],[35,11,37,11]]}
[null,null,null,null,null,null,null,null,null,null,null,null,null,null,"    CFF -","CRONOGRAMA FÍSICO-FINANCEIRO"]
[null,null,null,null,null,null,null,null,null,null,null,null,null,null,null,{"$f":"CHOOSE(1+LOG(1+2*(TipoOrçamento=\"BASE\")+4*(TipoOrçamento=\"LICITADO\")+8*(TipoOrçamento=\"REPROGRAMADOAC\")+16*(TipoOrçamento=\"REPROGRAMADONPL\"),2),\"nada\",\"Cronograma Base para Licitação\",\"Cronograma Licitado\",\"Cronograma Licitado Reprogramado\",\"Cronograma Base para Licitação - Reprogramado\")","v":"Cronograma Base para Licitação"}]
[]
[]
[]
[]
[]
["Nível Máx Crono",null,null,null,null,null,null,null,null,null,null,{"$f":"IF(MAX($A$14:$A$52)<>MAX(PO!$V$12:$V$142),\"ERRO: CRONOGRAMA DESATUALIZADO\",IF(OR(COUNTIF($O$16:$X$16,\">1\")>0,OFFSET($X$17,0,-1)<>$N$14),\"ERRO: CRONOGRAMA NÃO FECHA EM 100%\",\"\"))","v":""},null,{"$f":"IF(TipoOrçamento=\"REPROGRAMADOAC\",\"Qtde de Medições realizadas\",\"\")","v":""}]
[2,null,null,null,null,null,null,null,null,null,null,null,null,1,{"$f":"IF(AND(TipoOrçamento=\"REPROGRAMADOAC\",$N$9>0),$N$9-1,0)","v":0},{"$f":"OFFSET(P9,0,-1)+1","v":1},2,3,4,5,6,7,8,null,null,null,null,null,{"$f":"OFFSET(AC9,0,-1)+1","v":1}]
["Lista Crono","Último Nível","Nível","Altura","N1","N2","N3","N4","Czero","Cnível","VTOTAL SOMA","Item","Descrição das Metas / Macrosserviços","Valores Totais (R$)",{"$f":"IF(TipoOrçamento=\"REPROGRAMADOAC\",\"Reinício de Obra\",\"Início de Obra\")&CHAR(10)&TEXT(DADOS!A48,\"dd/mm/aa\")","v":"Início de Obra\n00/01/00"},{"$f":"IF(AND(TipoOrçamento=\"REPROGRAMADOAC\",$N$9>0,N10=\"Valores Totais (R$)\"),\"Parcela \"&$N$9&\" Executado\",\"Parcela \"&P$9&CHAR(10)&TEXT(DATE(YEAR(DADOS!$A$48),MONTH(DADOS!$A$48)+P$9-IF(AND(TipoOrçamento=\"REPROGRAMADOAC\",$N$9>0),$N$9,0),1),\"mmm/aa\"))","v":"Parcela 1\nfev/00"},{"$f":"IF(AND(TipoOrçamento=\"REPROGRAMADOAC\",$N$9>0,O10=\"Valores Totais (R$)\"),\"Parcela \"&$N$9&\" Executado\",\"Parcela \"&Q$9&CHAR(10)&TEXT(DATE(YEAR(DADOS!$A$48),MONTH(DADOS!$A$48)+Q$9-IF(AND(TipoOrçamento=\"REPROGRAMADOAC\",$N$9>0),$N$9,0),1),\"mmm/aa\"))","v":"Parcela 2\nmar/00"},{"$f":"IF(AND(TipoOrçamento=\"REPROGRAMADOAC\",$N$9>0,P10=\"Valores Totais (R$)\"),\"Parcela \"&$N$9&\" Executado\",\"Parcela \"&R$9&CHAR(10)&TEXT(DATE(YEAR(DADOS!$A$48),MONTH(DADOS!$A$48)+R$9-IF(AND(TipoOrçamento=\"REPROGRAMADOAC\",$N$9>0),$N$9,0),1),\"mmm/aa\"))","v":"Parcela 3\nabr/00"},{"$f":"IF(AND(TipoOrçamento=\"REPROGRAMADOAC\",$N$9>0,Q10=\"Valores Totais (R$)\"),\"Parcela \"&$N$9&\" Executado\",\"Parcela \"&S$9&CHAR(10)&TEXT(DATE(YEAR(DADOS!$A$48),MONTH(DADOS!$A$48)+S$9-IF(AND(TipoOrçamento=\"REPROGRAMADOAC\",$N$9>0),$N$9,0),1),\"mmm/aa\"))","v":"Parcela 4\nmai/00"},{"$f":"IF(AND(TipoOrçamento=\"REPROGRAMADOAC\",$N$9>0,R10=\"Valores Totais (R$)\"),\"Parcela \"&$N$9&\" Executado\",\"Parcela \"&T$9&CHAR(10)&TEXT(DATE(YEAR(DADOS!$A$48),MONTH(DADOS!$A$48)+T$9-IF(AND(TipoOrçamento=\"REPROGRAMADOAC\",$N$9>0),$N$9,0),1),\"mmm/aa\"))","v":"Parcela 5\njun/00"},{"$f":"IF(AND(TipoOrçamento=\"REPROGRAMADOAC\",$N$9>0,S10=\"Valores Totais (R$)\"),\"Parcela \"&$N$9&\" Executado\",\"Parcela \"&U$9&CHAR(10)&TEXT(DATE(YEAR(DADOS!$A$48),MONTH(DADOS!$A$48)+U$9-IF(AND(TipoOrçamento=\"REPROGRAMADOAC\",$N$9>0),$N$9,0),1),\"mmm/aa\"))","v":"Parcela 6\njul/00"},{"$f":"IF(AND(TipoOrçamento=\"REPROGRAMADOAC\",$N$9>0,T10=\"Valores Totais (R$)\"),\"Parcela \"&$N$9&\" Executado\",\"Parcela \"&V$9&CHAR(10)&TEXT(DATE(YEAR(DADOS!$A$48),MONTH(DADOS!$A$48)+V$9-IF(AND(TipoOrçamento=\"REPROGRAMADOAC\",$N$9>0),$N$9,0),1),\"mmm/aa\"))","v":"Parcela 7\nago/00"},{"$f":"IF(AND(TipoOrçamento=\"REPROGRAMADOAC\",$N$9>0,U10=\"Valores Totais (R$)\"),\"Parcela \"&$N$9&\" Executado\",\"Parcela \"&W$9&CHAR(10)&TEXT(DATE(YEAR(DADOS!$A$48),MONTH(DADOS!$A$48)+W$9-IF(AND(TipoOrçamento=\"REPROGRAMADOAC\",$N$9>0),$N$9,0),1),\"mmm/aa\"))","v":"Parcela 8\nset/00"},null,null,null,null,null,{"$f":"IF(AND(TipoOrçamento=\"REPROGRAMADOAC\",$N$9>0,AA10=\"Valores Totais (R$)\"),\"Parcela \"&$N$9&\" Executado\",\"Parcela \"&AC$9&CHAR(10)&TEXT(DATE(YEAR(DADOS!$A$48),MONTH(DADOS!$A$48)+AC$9-IF(AND(TipoOrçamento=\"REPROGRAMADOAC\",$N$9>0),$N$9,0),1),\"mmm/aa\"))","v":"Parcela 1\nfev/00"}]
[null,null,null,null,null,null,null,null,null,null,null,{"$f":"INDEX(PO!K$12:K$142,MATCH($A13,PO!$V$12:$V$142,0))","v":{"$error":"#VALUE!"}},{"$f":"INDEX(PO!N$12:N$142,MATCH($A13,PO!$V$12:$V$142,0))","v":{"$error":"#VALUE!"}},{"$f":"IF(ROUND(K13,2)=0,K13,ROUND(K13,2))","v":{"$error":"#VALUE!"}},"Parcela (%)",{"$f":"IF($B13,0,P12-IF(ISNUMBER(O12),O12,0))","v":{"$error":"#VALUE!"}},{"$f":"IF($B13,0,Q12-IF(ISNUMBER(P12),P12,0))","v":{"$error":"#VALUE!"}},{"$error":"#VALUE!"},{"$error":"#VALUE!"},{"$error":"#VALUE!"},{"$error":"#VALUE!"},{"$error":"#VALUE!"},{"$error":"#VALUE!"},null,null,null,null,null,{"$f":"IF($B13,0,AC12-IF(ISNUMBER(AB12),AB12,0))","v":{"$error":"#VALUE!"}}]
[null,null,null,null,null,null,null,null,null,null,null,null,null,null,"Acumulado (%)",{"$f":"MIN(IF($B13,P11+IF(ISNUMBER(O12),O12,0),P13/$N11),1)","v":{"$error":"#VALUE!"}},{"$f":"MIN(IF($B13,Q11+IF(ISNUMBER(P12),P12,0),Q13/$N11),1)","v":{"$error":"#VALUE!"}},{"$error":"#VALUE!"},{"$error":"#VALUE!"},{"$error":"#VALUE!"},{"$error":"#VALUE!"},{"$error":"#VALUE!"},{"$error":"#VALUE!"},null,null,null,null,null,{"$f":"MIN(IF($B13,AC11+IF(ISNUMBER(AB12),AB12,0),AC13/$N11),1)","v":{"$error":"#VALUE!"}}]
[{"$f":"OFFSET(A13,-CFF.NumLinha,0)+1","v":{"$error":"#VALUE!"}},{"$f":"$C13>=OFFSET($C13,CFF.NumLinha,0)","v":{"$error":"#VALUE!"}},{"$f":"INDEX(PO!A$12:A$142,MATCH($A13,PO!$V$12:$V$142,0))","v":{"$error":"#VALUE!"}},{"$f":"IF(ISERROR(J13),I13,SMALL(I13:J13,1))-1","v":{"$error":"#VALUE!"}},{"$f":"IF($C13=1,OFFSET(E13,-CFF.NumLinha,0)+1,OFFSET(E13,-CFF.NumLinha,0))","v":{"$error":"#VALUE!"}},{"$f":"IF($C13=1,0,IF($C13=2,OFFSET(F13,-CFF.NumLinha,0)+1,OFFSET(F13,-CFF.NumLinha,0)))","v":{"$error":"#VALUE!"}},{"$f":"IF(AND($C13<=2,$C13<>0),0,IF($C13=3,OFFSET(G13,-CFF.NumLinha,0)+1,OFFSET(G13,-CFF.NumLinha,0)))","v":{"$error":"#VALUE!"}},{"$f":"IF(AND($C13<=3,$C13<>0),0,IF($C13=4,OFFSET(H13,-CFF.NumLinha,0)+1,OFFSET(H13,-CFF.NumLinha,0)))","v":{"$error":"#VALUE!"}},{"$f":"MATCH(0,OFFSET($D13,1,$C13,ROW($A$51)-ROW($A13)),0)","v":{"$error":"#VALUE!"}},{"$f":"MATCH(OFFSET($D13,0,$C13)+1,OFFSET($D13,1,$C13,ROW($A$51)-ROW($A13)),0)","v":{"$error":"#VALUE!"}},{"$f":"ROUND(INDEX(PO!T$12:T$142,MATCH($A13,PO!$V$12:$V$142,0)),2)+10^-12","v":{"$error":"#VALUE!"}},null,null,null,"Acumulado (R$)",{"$f":"IF($B13,ROUND(P12*$N11,2),ROUND(SUMIF(OFFSET($B13,1,0,$D13),TRUE,OFFSET(P13,1,0,$D13))/SUMIF(OFFSET($B13,1,0,$D13),TRUE,OFFSET($K13,1,0,$D13))*$N11,2))","v":{"$error":"#VALUE!"}},{"$f":"IF($B13,ROUND(Q12*$N11,2),ROUND(SUMIF(OFFSET($B13,1,0,$D13),TRUE,OFFSET(Q13,1,0,$D13))/SUMIF(OFFSET($B13,1,0,$D13),TRUE,OFFSET($K13,1,0,$D13))*$N11,2))","v":{"$error":"#VALUE!"}},{"$error":"#VALUE!"},{"$error":"#VALUE!"},{"$error":"#VALUE!"},{"$error":"#VALUE!"},{"$error":"#VALUE!"},{"$error":"#VALUE!"},null,null,null,null,null,{"$f":"IF($B13,ROUND(AC12*$N11,2),ROUND(SUMIF(OFFSET($B13,1,0,$D13),TRUE,OFFSET(AC13,1,0,$D13))/SUMIF(OFFSET($B13,1,0,$D13),TRUE,OFFSET($K13,1,0,$D13))*$N11,2))","v":{"$error":"#VALUE!"}}]
[null,null,null,null,null,null,null,null,null,null,null,"CRONOGRAMA GLOBAL DO LOTE",null,{"$f":"IF(PO!$T$12=0,10^-12,PO!$T$12)","v":91360.200000000041},"Parcela (%)",{"$f":"ROUND(P15/$N14,4)","v":0.43969999999999998},{"$f":"ROUND(Q15/$N14,4)","v":0.22650000000000001},0.33379999999999999,0,0,0,0,0,null,null,null,null,null,{"$f":"ROUND(AC15/$N14,4)","v":0}]
[null,null,null,null,null,null,null,null,null,null,null,null,null,null,"Parcela (R$)",{"$f":"P17-IF(ISNUMBER(O17),O17,0)","v":40169.160000000003},{"$f":"Q17-IF(ISNUMBER(P17),P17,0)","v":20695.839999999997},30495.199999999997,0,0,0,0,0,null,null,null,null,null,{"$f":"AC17-IF(ISNUMBER(AB17),AB17,0)","v":0}]
[null,null,null,null,null,null,null,null,null,null,null,null,null,null,"Acumulado (%)",{"$f":"ROUND(P17/$N14,4)","v":0.43969999999999998},{"$f":"ROUND(Q17/$N14,4)","v":0.66620000000000001},1,1,1,1,1,1,null,null,null,null,null,{"$f":"ROUND(AC17/$N14,4)","v":0}]
[0,null,null,{"$f":"ROW(D$51)-ROW(D18)","v":33},null,null,null,null,null,null,null,null,null,null,"Acumulado (R$)",{"$f":"SUMIF(OFFSET($C17,1,0):$C$51,1,OFFSET(P17,1,0):P$51)","v":40169.160000000003},{"$f":"SUMIF(OFFSET($C17,1,0):$C$51,1,OFFSET(Q17,1,0):Q$51)","v":60865},{"$f":"SUMIF(OFFSET($C17,1,0):$C$51,1,OFFSET(R17,1,0):R$51)","v":91360.2},{"$f":"SUMIF(OFFSET($C17,1,0):$C$51,1,OFFSET(S17,1,0):S$51)","v":91360.2},{"$f":"SUMIF(OFFSET($C17,1,0):$C$51,1,OFFSET(T17,1,0):T$51)","v":91360.2},{"$f":"SUMIF(OFFSET($C17,1,0):$C$51,1,OFFSET(U17,1,0):U$51)","v":91360.2},{"$f":"SUMIF(OFFSET($C17,1,0):$C$51,1,OFFSET(V17,1,0):V$51)","v":91360.2},{"$f":"SUMIF(OFFSET($C17,1,0):$C$51,1,OFFSET(W17,1,0):W$51)","v":91360.2},null,null,null,null,null,{"$f":"SUMIF(OFFSET($C17,1,0):$C$51,1,OFFSET(AC17,1,0):AC$51)","v":0}]
[null,null,null,null,null,null,null,null,null,null,null,{"$f":"INDEX(PO!K$12:K$142,MATCH($A20,PO!$V$12:$V$142,0))","v":"1."},{"$f":"INDEX(PO!N$12:N$142,MATCH($A20,PO!$V$12:$V$142,0))","v":" RESIDÊNCIA POPULAR UNIFAMILIARES EM MADEIRA"},{"$f":"IF(ROUND(K20,2)=0,K20,ROUND(K20,2))","v":91360.2},"Parcela (%)",0.2,0.3,0.3,0.2,{"$f":"IF($B20,0,T19-IF(ISNUMBER(S19),S19,0))","v":0},0,0,0,"",null,null,null,null,{"$f":"IF($B20,0,AC19-IF(ISNUMBER(AB19),AB19,0))","v":0}]
[null,null,null,null,null,null,null,null,null,null,null,null,null,null,"Acumulado (%)",{"$f":"MIN(IF($B20,P18+IF(ISNUMBER(O19),O19,0),P20/$N18),1)","v":0.43967898494092617},0.66620913702027795,1,1,1,1,1,1,null,null,null,null,null,{"$f":"MIN(IF($B20,AC18+IF(ISNUMBER(AB19),AB19,0),AC20/$N18),1)","v":0}]
[{"$f":"OFFSET(A20,-CFF.NumLinha,0)+1","v":1},{"$f":"$C20>=OFFSET($C20,CFF.NumLinha,0)","v":false},{"$f":"INDEX(PO!A$12:A$142,MATCH($A20,PO!$V$12:$V$142,0))","v":1},{"$f":"IF(ISERROR(J20),I20,SMALL(I20:J20,1))-1","v":30},{"$f":"IF($C20=1,OFFSET(E20,-CFF.NumLinha,0)+1,OFFSET(E20,-CFF.NumLinha,0))","v":1},{"$f":"IF($C20=1,0,IF($C20=2,OFFSET(F20,-CFF.NumLinha,0)+1,OFFSET(F20,-CFF.NumLinha,0)))","v":0},{"$f":"IF(AND($C20<=2,$C20<>0),0,IF($C20=3,OFFSET(G20,-CFF.NumLinha,0)+1,OFFSET(G20,-CFF.NumLinha,0)))","v":0},{"$f":"IF(AND($C20<=3,$C20<>0),0,IF($C20=4,OFFSET(H20,-CFF.NumLinha,0)+1,OFFSET(H20,-CFF.NumLinha,0)))","v":0},{"$f":"MATCH(0,OFFSET($D20,1,$C20,ROW($A$51)-ROW($A20)),0)","v":31},{"$f":"MATCH(OFFSET($D20,0,$C20)+1,OFFSET($D20,1,$C20,ROW($A$51)-ROW($A20)),0)","v":{"$error":"#N/A"}},{"$f":"ROUND(INDEX(PO!T$12:T$142,MATCH($A20,PO!$V$12:$V$142,0)),2)+10^-12","v":91360.2},null,null,null,"Acumulado (R$)",{"$f":"IF($B20,ROUND(P19*$N18,2),ROUND(SUMIF(OFFSET($B20,1,0,$D20),TRUE,OFFSET(P20,1,0,$D20))/SUMIF(OFFSET($B20,1,0,$D20),TRUE,OFFSET($K20,1,0,$D20))*$N18,2))","v":40169.160000000003},60865,91360.2,91360.2,91360.2,91360.2,91360.2,91360.2,null,null,null,null,null,{"$f":"IF($B20,ROUND(AC19*$N18,2),ROUND(SUMIF(OFFSET($B20,1,0,$D20),TRUE,OFFSET(AC20,1,0,$D20))/SUMIF(OFFSET($B20,1,0,$D20),TRUE,OFFSET($K20,1,0,$D20))*$N18,2))","v":0}]
[null,null,null,null,null,null,null,null,null,null,null,{"$f":"INDEX(PO!K$12:K$142,MATCH($A23,PO!$V$12:$V$142,0))","v":"1.1."},{"$f":"INDEX(PO!N$12:N$142,MATCH($A23,PO!$V$12:$V$142,0))","v":"SERVIÇOS PRELIMINARES"},{"$f":"IF(ROUND(K23,2)=0,K23,ROUND(K23,2))","v":3555.62},"Parcela (%)",1,{"$f":"IF($B23,0,Q22-IF(ISNUMBER(P22),P22,0))","v":0},{"$f":"IF($B23,0,R22-IF(ISNUMBER(Q22),Q22,0))","v":0},{"$f":"IF($B23,0,S22-IF(ISNUMBER(R22),R22,0))","v":0},{"$f":"IF($B23,0,T22-IF(ISNUMBER(S22),S22,0))","v":0},{"$f":"IF($B23,0,U22-IF(ISNUMBER(T22),T22,0))","v":0},{"$f":"IF($B23,0,V22-IF(ISNUMBER(U22),U22,0))","v":0},{"$f":"IF($B23,0,W22-IF(ISNUMBER(V22),V22,0))","v":0},null,null,null,null,null,{"$f":"IF($B23,0,AC22-IF(ISNUMBER(AB22),AB22,0))","v":0}]
[null,null,null,null,null,null,null,null,null,null,null,null,null,null,"Acumulado (%)",{"$f":"MIN(IF($B23,P21+IF(ISNUMBER(O22),O22,0),P23/$N21),1)","v":1},{"$f":"MIN(IF($B23,Q21+IF(ISNUMBER(P22),P22,0),Q23/$N21),1)","v":1},{"$f":"MIN(IF($B23,R21+IF(ISNUMBER(Q22),Q22,0),R23/$N21),1)","v":1},{"$f":"MIN(IF($B23,S21+IF(ISNUMBER(R22),R22,0),S23/$N21),1)","v":1},{"$f":"MIN(IF($B23,T21+IF(ISNUMBER(S22),S22,0),T23/$N21),1)","v":1},{"$f":"MIN(IF($B23,U21+IF(ISNUMBER(T22),T22,0),U23/$N21),1)","v":1},{"$f":"MIN(IF($B23,V21+IF(ISNUMBER(U22),U22,0),V23/$N21),1)","v":1},{"$f":"MIN(IF($B23,W21+IF(ISNUMBER(V22),V22,0),W23/$N21),1)","v":1},null,null,null,null,null,{"$f":"MIN(IF($B23,AC21+IF(ISNUMBER(AB22),AB22,0),AC23/$N21),1)","v":0}]
[{"$f":"OFFSET(A23,-CFF.NumLinha,0)+1","v":2},{"$f":"$C23>=OFFSET($C23,CFF.NumLinha,0)","v":true},{"$f":"INDEX(PO!A$12:A$142,MATCH($A23,PO!$V$12:$V$142,0))","v":2},{"$f":"IF(ISERROR(J23),I23,SMALL(I23:J23,1))-1","v":2},{"$f":"IF($C23=1,OFFSET(E23,-CFF.NumLinha,0)+1,OFFSET(E23,-CFF.NumLinha,0))","v":1},{"$f":"IF($C23=1,0,IF($C23=2,OFFSET(F23,-CFF.NumLinha,0)+1,OFFSET(F23,-CFF.NumLinha,0)))","v":1},{"$f":"IF(AND($C23<=2,$C23<>0),0,IF($C23=3,OFFSET(G23,-CFF.NumLinha,0)+1,OFFSET(G23,-CFF.NumLinha,0)))","v":0},{"$f":"IF(AND($C23<=3,$C23<>0),0,IF($C23=4,OFFSET(H23,-CFF.NumLinha,0)+1,OFFSET(H23,-CFF.NumLinha,0)))","v":0},{"$f":"MATCH(0,OFFSET($D23,1,$C23,ROW($A$51)-ROW($A23)),0)","v":28},{"$f":"MATCH(OFFSET($D23,0,$C23)+1,OFFSET($D23,1,$C23,ROW($A$51)-ROW($A23)),0)","v":3},{"$f":"ROUND(INDEX(PO!T$12:T$142,MATCH($A23,PO!$V$12:$V$142,0)),2)+10^-12","v":3555.6200000000008},null,null,null,"Acumulado (R$)",{"$f":"IF($B23,ROUND(P22*$N21,2),ROUND(SUMIF(OFFSET($B23,1,0,$D23),TRUE,OFFSET(P23,1,0,$D23))/SUMIF(OFFSET($B23,1,0,$D23),TRUE,OFFSET($K23,1,0,$D23))*$N21,2))","v":3555.62},3555.62,3555.62,3555.62,3555.62,3555.62,3555.62,3555.62,null,null,null,null,null,{"$f":"IF($B23,ROUND(AC22*$N21,2),ROUND(SUMIF(OFFSET($B23,1,0,$D23),TRUE,OFFSET(AC23,1,0,$D23))/SUMIF(OFFSET($B23,1,0,$D23),TRUE,OFFSET($K23,1,0,$D23))*$N21,2))","v":0}]
[null,null,null,null,null,null,null,null,null,null,null,{"$f":"INDEX(PO!K$12:K$142,MATCH($A26,PO!$V$12:$V$142,0))","v":"1.2."},{"$f":"INDEX(PO!N$12:N$142,MATCH($A26,PO!$V$12:$V$142,0))","v":"INFRAESTRUTURA"},{"$f":"IF(ROUND(K26,2)=0,K26,ROUND(K26,2))","v":10972.2},"Parcela (%)",1,{"$f":"IF($B26,0,Q25-IF(ISNUMBER(P25),P25,0))","v":0},{"$f":"IF($B26,0,R25-IF(ISNUMBER(Q25),Q25,0))","v":0},{"$f":"IF($B26,0,S25-IF(ISNUMBER(R25),R25,0))","v":0},{"$f":"IF($B26,0,T25-IF(ISNUMBER(S25),S25,0))","v":0},{"$f":"IF($B26,0,U25-IF(ISNUMBER(T25),T25,0))","v":0},{"$f":"IF($B26,0,V25-IF(ISNUMBER(U25),U25,0))","v":0},{"$f":"IF($B26,0,W25-IF(ISNUMBER(V25),V25,0))","v":0},null,null,null,null,null,{"$f":"IF($B26,0,AC25-IF(ISNUMBER(AB25),AB25,0))","v":0}]
[null,null,null,null,null,null,null,null,null,null,null,null,null,null,"Acumulado (%)",{"$f":"MIN(IF($B26,P24+IF(ISNUMBER(O25),O25,0),P26/$N24),1)","v":1},{"$f":"MIN(IF($B26,Q24+IF(ISNUMBER(P25),P25,0),Q26/$N24),1)","v":1},{"$f":"MIN(IF($B26,R24+IF(ISNUMBER(Q25),Q25,0),R26/$N24),1)","v":1},{"$f":"MIN(IF($B26,S24+IF(ISNUMBER(R25),R25,0),S26/$N24),1)","v":1},{"$f":"MIN(IF($B26,T24+IF(ISNUMBER(S25),S25,0),T26/$N24),1)","v":1},{"$f":"MIN(IF($B26,U24+IF(ISNUMBER(T25),T25,0),U26/$N24),1)","v":1},{"$f":"MIN(IF($B26,V24+IF(ISNUMBER(U25),U25,0),V26/$N24),1)","v":1},{"$f":"MIN(IF($B26,W24+IF(ISNUMBER(V25),V25,0),W26/$N24),1)","v":1},null,null,null,null,null,{"$f":"MIN(IF($B26,AC24+IF(ISNUMBER(AB25),AB25,0),AC26/$N24),1)","v":0}]
[{"$f":"OFFSET(A26,-CFF.NumLinha,0)+1","v":3},{"$f":"$C26>=OFFSET($C26,CFF.NumLinha,0)","v":true},{"$f":"INDEX(PO!A$12:A$142,MATCH($A26,PO!$V$12:$V$142,0))","v":2},{"$f":"IF(ISERROR(J26),I26,SMALL(I26:J26,1))-1","v":2},{"$f":"IF($C26=1,OFFSET(E26,-CFF.NumLinha,0)+1,OFFSET(E26,-CFF.NumLinha,0))","v":1},{"$f":"IF($C26=1,0,IF($C26=2,OFFSET(F26,-CFF.NumLinha,0)+1,OFFSET(F26,-CFF.NumLinha,0)))","v":2},{"$f":"IF(AND($C26<=2,$C26<>0),0,IF($C26=3,OFFSET(G26,-CFF.NumLinha,0)+1,OFFSET(G26,-CFF.NumLinha,0)))","v":0},{"$f":"IF(AND($C26<=3,$C26<>0),0,IF($C26=4,OFFSET(H26,-CFF.NumLinha,0)+1,OFFSET(H26,-CFF.NumLinha,0)))","v":0},{"$f":"MATCH(0,OFFSET($D26,1,$C26,ROW($A$51)-ROW($A26)),0)","v":25},{"$f":"MATCH(OFFSET($D26,0,$C26)+1,OFFSET($D26,1,$C26,ROW($A$51)-ROW($A26)),0)","v":3},{"$f":"ROUND(INDEX(PO!T$12:T$142,MATCH($A26,PO!$V$12:$V$142,0)),2)+10^-12","v":10972.200000000003},null,null,null,"Acumulado (R$)",{"$f":"IF($B26,ROUND(P25*$N24,2),ROUND(SUMIF(OFFSET($B26,1,0,$D26),TRUE,OFFSET(P26,1,0,$D26))/SUMIF(OFFSET($B26,1,0,$D26),TRUE,OFFSET($K26,1,0,$D26))*$N24,2))","v":10972.2},10972.2,10972.2,10972.2,10972.2,10972.2,10972.2,10972.2,null,null,null,null,null,{"$f":"IF($B26,ROUND(AC25*$N24,2),ROUND(SUMIF(OFFSET($B26,1,0,$D26),TRUE,OFFSET(AC26,1,0,$D26))/SUMIF(OFFSET($B26,1,0,$D26),TRUE,OFFSET($K26,1,0,$D26))*$N24,2))","v":0}]
[null,null,null,null,null,null,null,null,null,null,null,{"$f":"INDEX(PO!K$12:K$142,MATCH($A29,PO!$V$12:$V$142,0))","v":"1.3."},{"$f":"INDEX(PO!N$12:N$142,MATCH($A29,PO!$V$12:$V$142,0))","v":"SUPRAESTRUTURA"},{"$f":"IF(ROUND(K29,2)=0,K29,ROUND(K29,2))","v":6468.63},"Parcela (%)",1,0.5,{"$f":"IF($B29,0,R28-IF(ISNUMBER(Q28),Q28,0))","v":0},{"$f":"IF($B29,0,S28-IF(ISNUMBER(R28),R28,0))","v":0},{"$f":"IF($B29,0,T28-IF(ISNUMBER(S28),S28,0))","v":0},{"$f":"IF($B29,0,U28-IF(ISNUMBER(T28),T28,0))","v":0},{"$f":"IF($B29,0,V28-IF(ISNUMBER(U28),U28,0))","v":0},{"$f":"IF($B29,0,W28-IF(ISNUMBER(V28),V28,0))","v":0},null,null,null,null,null,{"$f":"IF($B29,0,AC28-IF(ISNUMBER(AB28),AB28,0))","v":0}]
[null,null,null,null,null,null,null,null,null,null,null,null,null,null,"Acumulado (%)",{"$f":"MIN(IF($B29,P27+IF(ISNUMBER(O28),O28,0),P29/$N27),1)","v":1},{"$f":"MIN(IF($B29,Q27+IF(ISNUMBER(P28),P28,0),Q29/$N27),1)","v":1},{"$f":"MIN(IF($B29,R27+IF(ISNUMBER(Q28),Q28,0),R29/$N27),1)","v":1},{"$f":"MIN(IF($B29,S27+IF(ISNUMBER(R28),R28,0),S29/$N27),1)","v":1},{"$f":"MIN(IF($B29,T27+IF(ISNUMBER(S28),S28,0),T29/$N27),1)","v":1},{"$f":"MIN(IF($B29,U27+IF(ISNUMBER(T28),T28,0),U29/$N27),1)","v":1},{"$f":"MIN(IF($B29,V27+IF(ISNUMBER(U28),U28,0),V29/$N27),1)","v":1},{"$f":"MIN(IF($B29,W27+IF(ISNUMBER(V28),V28,0),W29/$N27),1)","v":1},null,null,null,null,null,{"$f":"MIN(IF($B29,AC27+IF(ISNUMBER(AB28),AB28,0),AC29/$N27),1)","v":0}]
[{"$f":"OFFSET(A29,-CFF.NumLinha,0)+1","v":4},{"$f":"$C29>=OFFSET($C29,CFF.NumLinha,0)","v":true},{"$f":"INDEX(PO!A$12:A$142,MATCH($A29,PO!$V$12:$V$142,0))","v":2},{"$f":"IF(ISERROR(J29),I29,SMALL(I29:J29,1))-1","v":2},{"$f":"IF($C29=1,OFFSET(E29,-CFF.NumLinha,0)+1,OFFSET(E29,-CFF.NumLinha,0))","v":1},{"$f":"IF($C29=1,0,IF($C29=2,OFFSET(F29,-CFF.NumLinha,0)+1,OFFSET(F29,-CFF.NumLinha,0)))","v":3},{"$f":"IF(AND($C29<=2,$C29<>0),0,IF($C29=3,OFFSET(G29,-CFF.NumLinha,0)+1,OFFSET(G29,-CFF.NumLinha,0)))","v":0},{"$f":"IF(AND($C29<=3,$C29<>0),0,IF($C29=4,OFFSET(H29,-CFF.NumLinha,0)+1,OFFSET(H29,-CFF.NumLinha,0)))","v":0},{"$f":"MATCH(0,OFFSET($D29,1,$C29,ROW($A$51)-ROW($A29)),0)","v":22},{"$f":"MATCH(OFFSET($D29,0,$C29)+1,OFFSET($D29,1,$C29,ROW($A$51)-ROW($A29)),0)","v":3},{"$f":"ROUND(INDEX(PO!T$12:T$142,MATCH($A29,PO!$V$12:$V$142,0)),2)+10^-12","v":6468.630000000001},null,null,null,"Acumulado (R$)",{"$f":"IF($B29,ROUND(P28*$N27,2),ROUND(SUMIF(OFFSET($B29,1,0,$D29),TRUE,OFFSET(P29,1,0,$D29))/SUMIF(OFFSET($B29,1,0,$D29),TRUE,OFFSET($K29,1,0,$D29))*$N27,2))","v":6468.63},6468.63,6468.63,6468.63,6468.63,6468.63,6468.63,6468.63,null,null,null,null,null,{"$f":"IF($B29,ROUND(AC28*$N27,2),ROUND(SUMIF(OFFSET($B29,1,0,$D29),TRUE,OFFSET(AC29,1,0,$D29))/SUMIF(OFFSET($B29,1,0,$D29),TRUE,OFFSET($K29,1,0,$D29))*$N27,2))","v":0}]
[null,null,null,null,null,null,null,null,null,null,null,{"$f":"INDEX(PO!K$12:K$142,MATCH($A32,PO!$V$12:$V$142,0))","v":"1.4."},{"$f":"INDEX(PO!N$12:N$142,MATCH($A32,PO!$V$12:$V$142,0))","v":"PAREDE"},{"$f":"IF(ROUND(K32,2)=0,K32,ROUND(K32,2))","v":24441.94},"Parcela (%)",0.6,0.4,0.4,{"$f":"IF($B32,0,S31-IF(ISNUMBER(R31),R31,0))","v":0},{"$f":"IF($B32,0,T31-IF(ISNUMBER(S31),S31,0))","v":0},{"$f":"IF($B32,0,U31-IF(ISNUMBER(T31),T31,0))","v":0},{"$f":"IF($B32,0,V31-IF(ISNUMBER(U31),U31,0))","v":0},{"$f":"IF($B32,0,W31-IF(ISNUMBER(V31),V31,0))","v":0},null,null,null,null,null,{"$f":"IF($B32,0,AC31-IF(ISNUMBER(AB31),AB31,0))","v":0}]
[null,null,null,null,null,null,null,null,null,null,null,null,null,null,"Acumulado (%)",{"$f":"MIN(IF($B32,P30+IF(ISNUMBER(O31),O31,0),P32/$N30),1)","v":0.6},{"$f":"MIN(IF($B32,Q30+IF(ISNUMBER(P31),P31,0),Q32/$N30),1)","v":1},{"$f":"MIN(IF($B32,R30+IF(ISNUMBER(Q31),Q31,0),R32/$N30),1)","v":1},{"$f":"MIN(IF($B32,S30+IF(ISNUMBER(R31),R31,0),S32/$N30),1)","v":1},{"$f":"MIN(IF($B32,T30+IF(ISNUMBER(S31),S31,0),T32/$N30),1)","v":1},{"$f":"MIN(IF($B32,U30+IF(ISNUMBER(T31),T31,0),U32/$N30),1)","v":1},{"$f":"MIN(IF($B32,V30+IF(ISNUMBER(U31),U31,0),V32/$N30),1)","v":1},{"$f":"MIN(IF($B32,W30+IF(ISNUMBER(V31),V31,0),W32/$N30),1)","v":1},null,null,null,null,null,{"$f":"MIN(IF($B32,AC30+IF(ISNUMBER(AB31),AB31,0),AC32/$N30),1)","v":0}]
[{"$f":"OFFSET(A32,-CFF.NumLinha,0)+1","v":5},{"$f":"$C32>=OFFSET($C32,CFF.NumLinha,0)","v":true},{"$f":"INDEX(PO!A$12:A$142,MATCH($A32,PO!$V$12:$V$142,0))","v":2},{"$f":"IF(ISERROR(J32),I32,SMALL(I32:J32,1))-1","v":2},{"$f":"IF($C32=1,OFFSET(E32,-CFF.NumLinha,0)+1,OFFSET(E32,-CFF.NumLinha,0))","v":1},{"$f":"IF($C32=1,0,IF($C32=2,OFFSET(F32,-CFF.NumLinha,0)+1,OFFSET(F32,-CFF.NumLinha,0)))","v":4},{"$f":"IF(AND($C32<=2,$C32<>0),0,IF($C32=3,OFFSET(G32,-CFF.NumLinha,0)+1,OFFSET(G32,-CFF.NumLinha,0)))","v":0},{"$f":"IF(AND($C32<=3,$C32<>0),0,IF($C32=4,OFFSET(H32,-CFF.NumLinha,0)+1,OFFSET(H32,-CFF.NumLinha,0)))","v":0},{"$f":"MATCH(0,OFFSET($D32,1,$C32,ROW($A$51)-ROW($A32)),0)","v":19},{"$f":"MATCH(OFFSET($D32,0,$C32)+1,OFFSET($D32,1,$C32,ROW($A$51)-ROW($A32)),0)","v":3},{"$f":"ROUND(INDEX(PO!T$12:T$142,MATCH($A32,PO!$V$12:$V$142,0)),2)+10^-12","v":24441.94},null,null,null,"Acumulado (R$)",{"$f":"IF($B32,ROUND(P31*$N30,2),ROUND(SUMIF(OFFSET($B32,1,0,$D32),TRUE,OFFSET(P32,1,0,$D32))/SUMIF(OFFSET($B32,1,0,$D32),TRUE,OFFSET($K32,1,0,$D32))*$N30,2))","v":14665.16},24441.94,24441.94,24441.94,24441.94,24441.94,24441.94,24441.94,null,null,null,null,null,{"$f":"IF($B32,ROUND(AC31*$N30,2),ROUND(SUMIF(OFFSET($B32,1,0,$D32),TRUE,OFFSET(AC32,1,0,$D32))/SUMIF(OFFSET($B32,1,0,$D32),TRUE,OFFSET($K32,1,0,$D32))*$N30,2))","v":0}]
[null,null,null,null,null,null,null,null,null,null,null,{"$f":"INDEX(PO!K$12:K$142,MATCH($A35,PO!$V$12:$V$142,0))","v":"1.5."},{"$f":"INDEX(PO!N$12:N$142,MATCH($A35,PO!$V$12:$V$142,0))","v":"REVESTIMENTOS"},{"$f":"IF(ROUND(K35,2)=0,K35,ROUND(K35,2))","v":9537.3700000000008},"Parcela (%)",0.2,0.4,0.4,{"$f":"IF($B35,0,S34-IF(ISNUMBER(R34),R34,0))","v":0},{"$f":"IF($B35,0,T34-IF(ISNUMBER(S34),S34,0))","v":0},{"$f":"IF($B35,0,U34-IF(ISNUMBER(T34),T34,0))","v":0},{"$f":"IF($B35,0,V34-IF(ISNUMBER(U34),U34,0))","v":0},{"$f":"IF($B35,0,W34-IF(ISNUMBER(V34),V34,0))","v":0},null,null,null,null,null,{"$f":"IF($B35,0,AC34-IF(ISNUMBER(AB34),AB34,0))","v":0}]
[null,null,null,null,null,null,null,null,null,null,null,null,null,null,"Acumulado (%)",{"$f":"MIN(IF($B35,P33+IF(ISNUMBER(O34),O34,0),P35/$N33),1)","v":0.2},{"$f":"MIN(IF($B35,Q33+IF(ISNUMBER(P34),P34,0),Q35/$N33),1)","v":0.60000000000000009},{"$f":"MIN(IF($B35,R33+IF(ISNUMBER(Q34),Q34,0),R35/$N33),1)","v":1},{"$f":"MIN(IF($B35,S33+IF(ISNUMBER(R34),R34,0),S35/$N33),1)","v":1},{"$f":"MIN(IF($B35,T33+IF(ISNUMBER(S34),S34,0),T35/$N33),1)","v":1},{"$f":"MIN(IF($B35,U33+IF(ISNUMBER(T34),T34,0),U35/$N33),1)","v":1},{"$f":"MIN(IF($B35,V33+IF(ISNUMBER(U34),U34,0),V35/$N33),1)","v":1},{"$f":"MIN(IF($B35,W33+IF(ISNUMBER(V34),V34,0),W35/$N33),1)","v":1},null,null,null,null,null,{"$f":"MIN(IF($B35,AC33+IF(ISNUMBER(AB34),AB34,0),AC35/$N33),1)","v":0}]
[{"$f":"OFFSET(A35,-CFF.NumLinha,0)+1","v":6},{"$f":"$C35>=OFFSET($C35,CFF.NumLinha,0)","v":true},{"$f":"INDEX(PO!A$12:A$142,MATCH($A35,PO!$V$12:$V$142,0))","v":2},{"$f":"IF(ISERROR(J35),I35,SMALL(I35:J35,1))-1","v":2},{"$f":"IF($C35=1,OFFSET(E35,-CFF.NumLinha,0)+1,OFFSET(E35,-CFF.NumLinha,0))","v":1},{"$f":"IF($C35=1,0,IF($C35=2,OFFSET(F35,-CFF.NumLinha,0)+1,OFFSET(F35,-CFF.NumLinha,0)))","v":5},{"$f":"IF(AND($C35<=2,$C35<>0),0,IF($C35=3,OFFSET(G35,-CFF.NumLinha,0)+1,OFFSET(G35,-CFF.NumLinha,0)))","v":0},{"$f":"IF(AND($C35<=3,$C35<>0),0,IF($C35=4,OFFSET(H35,-CFF.NumLinha,0)+1,OFFSET(H35,-CFF.NumLinha,0)))","v":0},{"$f":"MATCH(0,OFFSET($D35,1,$C35,ROW($A$51)-ROW($A35)),0)","v":16},{"$f":"MATCH(OFFSET($D35,0,$C35)+1,OFFSET($D35,1,$C35,ROW($A$51)-ROW($A35)),0)","v":3},{"$f":"ROUND(INDEX(PO!T$12:T$142,MATCH($A35,PO!$V$12:$V$142,0)),2)+10^-12","v":9537.3700000000026},null,null,null,"Acumulado (R$)",{"$f":"IF($B35,ROUND(P34*$N33,2),ROUND(SUMIF(OFFSET($B35,1,0,$D35),TRUE,OFFSET(P35,1,0,$D35))/SUMIF(OFFSET($B35,1,0,$D35),TRUE,OFFSET($K35,1,0,$D35))*$N33,2))","v":1907.47},5722.42,9537.3700000000008,9537.3700000000008,9537.3700000000008,9537.3700000000008,9537.3700000000008,9537.3700000000008,null,null,null,null,null,{"$f":"IF($B35,ROUND(AC34*$N33,2),ROUND(SUMIF(OFFSET($B35,1,0,$D35),TRUE,OFFSET(AC35,1,0,$D35))/SUMIF(OFFSET($B35,1,0,$D35),TRUE,OFFSET($K35,1,0,$D35))*$N33,2))","v":0}]
[null,null,null,null,null,null,null,null,null,null,null,{"$f":"INDEX(PO!K$12:K$142,MATCH($A38,PO!$V$12:$V$142,0))","v":"1.6."},{"$f":"INDEX(PO!N$12:N$142,MATCH($A38,PO!$V$12:$V$142,0))","v":"PAVIMENTAÇÃO INTERNA"},{"$f":"IF(ROUND(K38,2)=0,K38,ROUND(K38,2))","v":6208.84},"Parcela (%)",{"$f":"IF($B38,0,P37-IF(ISNUMBER(O37),O37,0))","v":0},0.4,0.6,{"$f":"IF($B38,0,S37-IF(ISNUMBER(R37),R37,0))","v":0},{"$f":"IF($B38,0,T37-IF(ISNUMBER(S37),S37,0))","v":0},{"$f":"IF($B38,0,U37-IF(ISNUMBER(T37),T37,0))","v":0},{"$f":"IF($B38,0,V37-IF(ISNUMBER(U37),U37,0))","v":0},{"$f":"IF($B38,0,W37-IF(ISNUMBER(V37),V37,0))","v":0},null,null,null,null,null,{"$f":"IF($B38,0,AC37-IF(ISNUMBER(AB37),AB37,0))","v":0}]
[null,null,null,null,null,null,null,null,null,null,null,null,null,null,"Acumulado (%)",{"$f":"MIN(IF($B38,P36+IF(ISNUMBER(O37),O37,0),P38/$N36),1)","v":0},{"$f":"MIN(IF($B38,Q36+IF(ISNUMBER(P37),P37,0),Q38/$N36),1)","v":0.4},{"$f":"MIN(IF($B38,R36+IF(ISNUMBER(Q37),Q37,0),R38/$N36),1)","v":1},{"$f":"MIN(IF($B38,S36+IF(ISNUMBER(R37),R37,0),S38/$N36),1)","v":1},{"$f":"MIN(IF($B38,T36+IF(ISNUMBER(S37),S37,0),T38/$N36),1)","v":1},{"$f":"MIN(IF($B38,U36+IF(ISNUMBER(T37),T37,0),U38/$N36),1)","v":1},{"$f":"MIN(IF($B38,V36+IF(ISNUMBER(U37),U37,0),V38/$N36),1)","v":1},{"$f":"MIN(IF($B38,W36+IF(ISNUMBER(V37),V37,0),W38/$N36),1)","v":1},null,null,null,null,null,{"$f":"MIN(IF($B38,AC36+IF(ISNUMBER(AB37),AB37,0),AC38/$N36),1)","v":0}]
[{"$f":"OFFSET(A38,-CFF.NumLinha,0)+1","v":7},{"$f":"$C38>=OFFSET($C38,CFF.NumLinha,0)","v":true},{"$f":"INDEX(PO!A$12:A$142,MATCH($A38,PO!$V$12:$V$142,0))","v":2},{"$f":"IF(ISERROR(J38),I38,SMALL(I38:J38,1))-1","v":2},{"$f":"IF($C38=1,OFFSET(E38,-CFF.NumLinha,0)+1,OFFSET(E38,-CFF.NumLinha,0))","v":1},{"$f":"IF($C38=1,0,IF($C38=2,OFFSET(F38,-CFF.NumLinha,0)+1,OFFSET(F38,-CFF.NumLinha,0)))","v":6},{"$f":"IF(AND($C38<=2,$C38<>0),0,IF($C38=3,OFFSET(G38,-CFF.NumLinha,0)+1,OFFSET(G38,-CFF.NumLinha,0)))","v":0},{"$f":"IF(AND($C38<=3,$C38<>0),0,IF($C38=4,OFFSET(H38,-CFF.NumLinha,0)+1,OFFSET(H38,-CFF.NumLinha,0)))","v":0},{"$f":"MATCH(0,OFFSET($D38,1,$C38,ROW($A$51)-ROW($A38)),0)","v":13},{"$f":"MATCH(OFFSET($D38,0,$C38)+1,OFFSET($D38,1,$C38,ROW($A$51)-ROW($A38)),0)","v":3},{"$f":"ROUND(INDEX(PO!T$12:T$142,MATCH($A38,PO!$V$12:$V$142,0)),2)+10^-12","v":6208.8400000000011},null,null,null,"Acumulado (R$)",{"$f":"IF($B38,ROUND(P37*$N36,2),ROUND(SUMIF(OFFSET($B38,1,0,$D38),TRUE,OFFSET(P38,1,0,$D38))/SUMIF(OFFSET($B38,1,0,$D38),TRUE,OFFSET($K38,1,0,$D38))*$N36,2))","v":0},2483.54,6208.84,6208.84,6208.84,6208.84,6208.84,6208.84,null,null,null,null,null,{"$f":"IF($B38,ROUND(AC37*$N36,2),ROUND(SUMIF(OFFSET($B38,1,0,$D38),TRUE,OFFSET(AC38,1,0,$D38))/SUMIF(OFFSET($B38,1,0,$D38),TRUE,OFFSET($K38,1,0,$D38))*$N36,2))","v":0}]
[null,null,null,null,null,null,null,null,null,null,null,{"$f":"INDEX(PO!K$12:K$142,MATCH($A41,PO!$V$12:$V$142,0))","v":"1.7."},{"$f":"INDEX(PO!N$12:N$142,MATCH($A41,PO!$V$12:$V$142,0))","v":"FORRO E COBERTURA"},{"$f":"IF(ROUND(K41,2)=0,K41,ROUND(K41,2))","v":16457.439999999999},"Parcela (%)",{"$f":"IF($B41,0,P40-IF(ISNUMBER(O40),O40,0))","v":0},{"$f":"IF($B41,0,Q40-IF(ISNUMBER(P40),P40,0))","v":0},1,1,{"$f":"IF($B41,0,T40-IF(ISNUMBER(S40),S40,0))","v":0},{"$f":"IF($B41,0,U40-IF(ISNUMBER(T40),T40,0))","v":0},{"$f":"IF($B41,0,V40-IF(ISNUMBER(U40),U40,0))","v":0},{"$f":"IF($B41,0,W40-IF(ISNUMBER(V40),V40,0))","v":0},null,null,null,null,null,{"$f":"IF($B41,0,AC40-IF(ISNUMBER(AB40),AB40,0))","v":0}]
[null,null,null,null,null,null,null,null,null,null,null,null,null,null,"Acumulado (%)",{"$f":"MIN(IF($B41,P39+IF(ISNUMBER(O40),O40,0),P41/$N39),1)","v":0},{"$f":"MIN(IF($B41,Q39+IF(ISNUMBER(P40),P40,0),Q41/$N39),1)","v":0},{"$f":"MIN(IF($B41,R39+IF(ISNUMBER(Q40),Q40,0),R41/$N39),1)","v":1},{"$f":"MIN(IF($B41,S39+IF(ISNUMBER(R40),R40,0),S41/$N39),1)","v":1},{"$f":"MIN(IF($B41,T39+IF(ISNUMBER(S40),S40,0),T41/$N39),1)","v":1},{"$f":"MIN(IF($B41,U39+IF(ISNUMBER(T40),T40,0),U41/$N39),1)","v":1},{"$f":"MIN(IF($B41,V39+IF(ISNUMBER(U40),U40,0),V41/$N39),1)","v":1},{"$f":"MIN(IF($B41,W39+IF(ISNUMBER(V40),V40,0),W41/$N39),1)","v":1},null,null,null,null,null,{"$f":"MIN(IF($B41,AC39+IF(ISNUMBER(AB40),AB40,0),AC41/$N39),1)","v":0}]
[{"$f":"OFFSET(A41,-CFF.NumLinha,0)+1","v":8},{"$f":"$C41>=OFFSET($C41,CFF.NumLinha,0)","v":true},{"$f":"INDEX(PO!A$12:A$142,MATCH($A41,PO!$V$12:$V$142,0))","v":2},{"$f":"IF(ISERROR(J41),I41,SMALL(I41:J41,1))-1","v":2},{"$f":"IF($C41=1,OFFSET(E41,-CFF.NumLinha,0)+1,OFFSET(E41,-CFF.NumLinha,0))","v":1},{"$f":"IF($C41=1,0,IF($C41=2,OFFSET(F41,-CFF.NumLinha,0)+1,OFFSET(F41,-CFF.NumLinha,0)))","v":7},{"$f":"IF(AND($C41<=2,$C41<>0),0,IF($C41=3,OFFSET(G41,-CFF.NumLinha,0)+1,OFFSET(G41,-CFF.NumLinha,0)))","v":0},{"$f":"IF(AND($C41<=3,$C41<>0),0,IF($C41=4,OFFSET(H41,-CFF.NumLinha,0)+1,OFFSET(H41,-CFF.NumLinha,0)))","v":0},{"$f":"MATCH(0,OFFSET($D41,1,$C41,ROW($A$51)-ROW($A41)),0)","v":10},{"$f":"MATCH(OFFSET($D41,0,$C41)+1,OFFSET($D41,1,$C41,ROW($A$51)-ROW($A41)),0)","v":3},{"$f":"ROUND(INDEX(PO!T$12:T$142,MATCH($A41,PO!$V$12:$V$142,0)),2)+10^-12","v":16457.439999999999},null,null,null,"Acumulado (R$)",{"$f":"IF($B41,ROUND(P40*$N39,2),ROUND(SUMIF(OFFSET($B41,1,0,$D41),TRUE,OFFSET(P41,1,0,$D41))/SUMIF(OFFSET($B41,1,0,$D41),TRUE,OFFSET($K41,1,0,$D41))*$N39,2))","v":0},0,16457.439999999999,16457.439999999999,16457.439999999999,16457.439999999999,16457.439999999999,16457.439999999999,null,null,null,null,null,{"$f":"IF($B41,ROUND(AC40*$N39,2),ROUND(SUMIF(OFFSET($B41,1,0,$D41),TRUE,OFFSET(AC41,1,0,$D41))/SUMIF(OFFSET($B41,1,0,$D41),TRUE,OFFSET($K41,1,0,$D41))*$N39,2))","v":0}]
[null,null,null,null,null,null,null,null,null,null,null,{"$f":"INDEX(PO!K$12:K$142,MATCH($A44,PO!$V$12:$V$142,0))","v":"1.8."},{"$f":"INDEX(PO!N$12:N$142,MATCH($A44,PO!$V$12:$V$142,0))","v":"ISTALAÇÕES ELÉTRICA"},{"$f":"IF(ROUND(K44,2)=0,K44,ROUND(K44,2))","v":5051.21},"Parcela (%)",{"$f":"IF($B44,0,P43-IF(ISNUMBER(O43),O43,0))","v":0},0.4,0.6,0.6,{"$f":"IF($B44,0,T43-IF(ISNUMBER(S43),S43,0))","v":0},{"$f":"IF($B44,0,U43-IF(ISNUMBER(T43),T43,0))","v":0},{"$f":"IF($B44,0,V43-IF(ISNUMBER(U43),U43,0))","v":0},{"$f":"IF($B44,0,W43-IF(ISNUMBER(V43),V43,0))","v":0},null,null,null,null,null,{"$f":"IF($B44,0,AC43-IF(ISNUMBER(AB43),AB43,0))","v":0}]
[null,null,null,null,null,null,null,null,null,null,null,null,null,null,"Acumulado (%)",{"$f":"MIN(IF($B44,P42+IF(ISNUMBER(O43),O43,0),P44/$N42),1)","v":0},{"$f":"MIN(IF($B44,Q42+IF(ISNUMBER(P43),P43,0),Q44/$N42),1)","v":0.4},{"$f":"MIN(IF($B44,R42+IF(ISNUMBER(Q43),Q43,0),R44/$N42),1)","v":1},{"$f":"MIN(IF($B44,S42+IF(ISNUMBER(R43),R43,0),S44/$N42),1)","v":1},{"$f":"MIN(IF($B44,T42+IF(ISNUMBER(S43),S43,0),T44/$N42),1)","v":1},{"$f":"MIN(IF($B44,U42+IF(ISNUMBER(T43),T43,0),U44/$N42),1)","v":1},{"$f":"MIN(IF($B44,V42+IF(ISNUMBER(U43),U43,0),V44/$N42),1)","v":1},{"$f":"MIN(IF($B44,W42+IF(ISNUMBER(V43),V43,0),W44/$N42),1)","v":1},null,null,null,null,null,{"$f":"MIN(IF($B44,AC42+IF(ISNUMBER(AB43),AB43,0),AC44/$N42),1)","v":0}]
[{"$f":"OFFSET(A44,-CFF.NumLinha,0)+1","v":9},{"$f":"$C44>=OFFSET($C44,CFF.NumLinha,0)","v":true},{"$f":"INDEX(PO!A$12:A$142,MATCH($A44,PO!$V$12:$V$142,0))","v":2},{"$f":"IF(ISERROR(J44),I44,SMALL(I44:J44,1))-1","v":2},{"$f":"IF($C44=1,OFFSET(E44,-CFF.NumLinha,0)+1,OFFSET(E44,-CFF.NumLinha,0))","v":1},{"$f":"IF($C44=1,0,IF($C44=2,OFFSET(F44,-CFF.NumLinha,0)+1,OFFSET(F44,-CFF.NumLinha,0)))","v":8},{"$f":"IF(AND($C44<=2,$C44<>0),0,IF($C44=3,OFFSET(G44,-CFF.NumLinha,0)+1,OFFSET(G44,-CFF.NumLinha,0)))","v":0},{"$f":"IF(AND($C44<=3,$C44<>0),0,IF($C44=4,OFFSET(H44,-CFF.NumLinha,0)+1,OFFSET(H44,-CFF.NumLinha,0)))","v":0},{"$f":"MATCH(0,OFFSET($D44,1,$C44,ROW($A$51)-ROW($A44)),0)","v":7},{"$f":"MATCH(OFFSET($D44,0,$C44)+1,OFFSET($D44,1,$C44,ROW($A$51)-ROW($A44)),0)","v":3},{"$f":"ROUND(INDEX(PO!T$12:T$142,MATCH($A44,PO!$V$12:$V$142,0)),2)+10^-12","v":5051.2100000000009},null,null,null,"Acumulado (R$)",{"$f":"IF($B44,ROUND(P43*$N42,2),ROUND(SUMIF(OFFSET($B44,1,0,$D44),TRUE,OFFSET(P44,1,0,$D44))/SUMIF(OFFSET($B44,1,0,$D44),TRUE,OFFSET($K44,1,0,$D44))*$N42,2))","v":0},2020.48,5051.21,5051.21,5051.21,5051.21,5051.21,5051.21,null,null,null,null,null,{"$f":"IF($B44,ROUND(AC43*$N42,2),ROUND(SUMIF(OFFSET($B44,1,0,$D44),TRUE,OFFSET(AC44,1,0,$D44))/SUMIF(OFFSET($B44,1,0,$D44),TRUE,OFFSET($K44,1,0,$D44))*$N42,2))","v":0}]
[null,null,null,null,null,null,null,null,null,null,null,{"$f":"INDEX(PO!K$12:K$142,MATCH($A47,PO!$V$12:$V$142,0))","v":"1.9."},{"$f":"INDEX(PO!N$12:N$142,MATCH($A47,PO!$V$12:$V$142,0))","v":"ISNSTALAÇÕES  HIDRÁULICAS "},{"$f":"IF(ROUND(K47,2)=0,K47,ROUND(K47,2))","v":3132.08},"Parcela (%)",0.3,0.3,0.4,0.4,{"$f":"IF($B47,0,T46-IF(ISNUMBER(S46),S46,0))","v":0},{"$f":"IF($B47,0,U46-IF(ISNUMBER(T46),T46,0))","v":0},{"$f":"IF($B47,0,V46-IF(ISNUMBER(U46),U46,0))","v":0},{"$f":"IF($B47,0,W46-IF(ISNUMBER(V46),V46,0))","v":0},null,null,null,null,null,{"$f":"IF($B47,0,AC46-IF(ISNUMBER(AB46),AB46,0))","v":0}]
[null,null,null,null,null,null,null,null,null,null,null,null,null,null,"Acumulado (%)",{"$f":"MIN(IF($B47,P45+IF(ISNUMBER(O46),O46,0),P47/$N45),1)","v":0.3},{"$f":"MIN(IF($B47,Q45+IF(ISNUMBER(P46),P46,0),Q47/$N45),1)","v":0.6},{"$f":"MIN(IF($B47,R45+IF(ISNUMBER(Q46),Q46,0),R47/$N45),1)","v":1},{"$f":"MIN(IF($B47,S45+IF(ISNUMBER(R46),R46,0),S47/$N45),1)","v":1},{"$f":"MIN(IF($B47,T45+IF(ISNUMBER(S46),S46,0),T47/$N45),1)","v":1},{"$f":"MIN(IF($B47,U45+IF(ISNUMBER(T46),T46,0),U47/$N45),1)","v":1},{"$f":"MIN(IF($B47,V45+IF(ISNUMBER(U46),U46,0),V47/$N45),1)","v":1},{"$f":"MIN(IF($B47,W45+IF(ISNUMBER(V46),V46,0),W47/$N45),1)","v":1},null,null,null,null,null,{"$f":"MIN(IF($B47,AC45+IF(ISNUMBER(AB46),AB46,0),AC47/$N45),1)","v":0}]
[{"$f":"OFFSET(A47,-CFF.NumLinha,0)+1","v":10},{"$f":"$C47>=OFFSET($C47,CFF.NumLinha,0)","v":true},{"$f":"INDEX(PO!A$12:A$142,MATCH($A47,PO!$V$12:$V$142,0))","v":2},{"$f":"IF(ISERROR(J47),I47,SMALL(I47:J47,1))-1","v":2},{"$f":"IF($C47=1,OFFSET(E47,-CFF.NumLinha,0)+1,OFFSET(E47,-CFF.NumLinha,0))","v":1},{"$f":"IF($C47=1,0,IF($C47=2,OFFSET(F47,-CFF.NumLinha,0)+1,OFFSET(F47,-CFF.NumLinha,0)))","v":9},{"$f":"IF(AND($C47<=2,$C47<>0),0,IF($C47=3,OFFSET(G47,-CFF.NumLinha,0)+1,OFFSET(G47,-CFF.NumLinha,0)))","v":0},{"$f":"IF(AND($C47<=3,$C47<>0),0,IF($C47=4,OFFSET(H47,-CFF.NumLinha,0)+1,OFFSET(H47,-CFF.NumLinha,0)))","v":0},{"$f":"MATCH(0,OFFSET($D47,1,$C47,ROW($A$51)-ROW($A47)),0)","v":4},{"$f":"MATCH(OFFSET($D47,0,$C47)+1,OFFSET($D47,1,$C47,ROW($A$51)-ROW($A47)),0)","v":3},{"$f":"ROUND(INDEX(PO!T$12:T$142,MATCH($A47,PO!$V$12:$V$142,0)),2)+10^-12","v":3132.0800000000008},null,null,null,"Acumulado (R$)",{"$f":"IF($B47,ROUND(P46*$N45,2),ROUND(SUMIF(OFFSET($B47,1,0,$D47),TRUE,OFFSET(P47,1,0,$D47))/SUMIF(OFFSET($B47,1,0,$D47),TRUE,OFFSET($K47,1,0,$D47))*$N45,2))","v":939.62},1879.25,3132.08,3132.08,3132.08,3132.08,3132.08,3132.08,null,null,null,null,null,{"$f":"IF($B47,ROUND(AC46*$N45,2),ROUND(SUMIF(OFFSET($B47,1,0,$D47),TRUE,OFFSET(AC47,1,0,$D47))/SUMIF(OFFSET($B47,1,0,$D47),TRUE,OFFSET($K47,1,0,$D47))*$N45,2))","v":0}]
[null,null,null,null,null,null,null,null,null,null,null,{"$f":"INDEX(PO!K$12:K$142,MATCH($A50,PO!$V$12:$V$142,0))","v":"1.10."},{"$f":"INDEX(PO!N$12:N$142,MATCH($A50,PO!$V$12:$V$142,0))","v":"INSTALAÇÕES SANITÁRIAS"},{"$f":"IF(ROUND(K50,2)=0,K50,ROUND(K50,2))","v":5534.87},"Parcela (%)",0.3,0.3,0.4,0.3,{"$f":"IF($B50,0,T49-IF(ISNUMBER(S49),S49,0))","v":0},{"$f":"IF($B50,0,U49-IF(ISNUMBER(T49),T49,0))","v":0},{"$f":"IF($B50,0,V49-IF(ISNUMBER(U49),U49,0))","v":0},{"$f":"IF($B50,0,W49-IF(ISNUMBER(V49),V49,0))","v":0},null,null,null,null,null,{"$f":"IF($B50,0,AC49-IF(ISNUMBER(AB49),AB49,0))","v":0}]
[null,null,null,null,null,null,null,null,null,null,null,null,null,null,"Acumulado (%)",{"$f":"MIN(IF($B50,P48+IF(ISNUMBER(O49),O49,0),P50/$N48),1)","v":0.3},{"$f":"MIN(IF($B50,Q48+IF(ISNUMBER(P49),P49,0),Q50/$N48),1)","v":0.6},{"$f":"MIN(IF($B50,R48+IF(ISNUMBER(Q49),Q49,0),R50/$N48),1)","v":1},{"$f":"MIN(IF($B50,S48+IF(ISNUMBER(R49),R49,0),S50/$N48),1)","v":1},{"$f":"MIN(IF($B50,T48+IF(ISNUMBER(S49),S49,0),T50/$N48),1)","v":1},{"$f":"MIN(IF($B50,U48+IF(ISNUMBER(T49),T49,0),U50/$N48),1)","v":1},{"$f":"MIN(IF($B50,V48+IF(ISNUMBER(U49),U49,0),V50/$N48),1)","v":1},{"$f":"MIN(IF($B50,W48+IF(ISNUMBER(V49),V49,0),W50/$N48),1)","v":1},null,null,null,null,null,{"$f":"MIN(IF($B50,AC48+IF(ISNUMBER(AB49),AB49,0),AC50/$N48),1)","v":0}]
[{"$f":"OFFSET(A50,-CFF.NumLinha,0)+1","v":11},{"$f":"$C50>=OFFSET($C50,CFF.NumLinha,0)","v":true},{"$f":"INDEX(PO!A$12:A$142,MATCH($A50,PO!$V$12:$V$142,0))","v":2},{"$f":"IF(ISERROR(J50),I50,SMALL(I50:J50,1))-1","v":0},{"$f":"IF($C50=1,OFFSET(E50,-CFF.NumLinha,0)+1,OFFSET(E50,-CFF.NumLinha,0))","v":1},{"$f":"IF($C50=1,0,IF($C50=2,OFFSET(F50,-CFF.NumLinha,0)+1,OFFSET(F50,-CFF.NumLinha,0)))","v":10},{"$f":"IF(AND($C50<=2,$C50<>0),0,IF($C50=3,OFFSET(G50,-CFF.NumLinha,0)+1,OFFSET(G50,-CFF.NumLinha,0)))","v":0},{"$f":"IF(AND($C50<=3,$C50<>0),0,IF($C50=4,OFFSET(H50,-CFF.NumLinha,0)+1,OFFSET(H50,-CFF.NumLinha,0)))","v":0},{"$f":"MATCH(0,OFFSET($D50,1,$C50,ROW($A$51)-ROW($A50)),0)","v":1},{"$f":"MATCH(OFFSET($D50,0,$C50)+1,OFFSET($D50,1,$C50,ROW($A$51)-ROW($A50)),0)","v":{"$error":"#N/A"}},{"$f":"ROUND(INDEX(PO!T$12:T$142,MATCH($A50,PO!$V$12:$V$142,0)),2)+10^-12","v":5534.8700000000008},null,null,null,"Acumulado (R$)",{"$f":"IF($B50,ROUND(P49*$N48,2),ROUND(SUMIF(OFFSET($B50,1,0,$D50),TRUE,OFFSET(P50,1,0,$D50))/SUMIF(OFFSET($B50,1,0,$D50),TRUE,OFFSET($K50,1,0,$D50))*$N48,2))","v":1660.46},3320.92,5534.87,5534.87,5534.87,5534.87,5534.87,5534.87,null,null,null,null,null,{"$f":"IF($B50,ROUND(AC49*$N48,2),ROUND(SUMIF(OFFSET($B50,1,0,$D50),TRUE,OFFSET(AC50,1,0,$D50))/SUMIF(OFFSET($B50,1,0,$D50),TRUE,OFFSET($K50,1,0,$D50))*$N48,2))","v":0}]
[null,null,-1,null,0,0,0,0]
[]
[null,null,null,null,null,null,null,null,null,null,null,{"$f":"DADOS!I32","v":0}]
[null,null,null,null,null,null,null,null,null,null,null,"Local"]
[]
[null,null,null,null,null,null,null,null,null,null,null,{"$f":"PO!K156","v":"2023-06-06"}]
[null,null,null,null,null,null,null,null,null,null,null,"Data"]